{"text_format":"1","workbook":"xlsx","n_sheets":7,"sheets":["Option vs Stock","Option vs Time","Other Graphs","Enter Values","Student Guided Sheet","Student Designed Sheet","Data"],"not_rendered":{"charts":9,"images":13,"macros":1,"external_links":0,"defined_names":0,"comments":0,"pivot_tables":0},"unopened":[],"bounds":{"document_bytes":16777216,"sheet_cells":100000,"rows_first":2000,"rows_last":500,"rows_between":2000,"halvings":0,"cell_chars":16384,"cell_head_chars":4096},"cells_cut":0,"cells_raw":0,"read":"whole","date_system":"1900"}

{"sheet":"Option vs Stock","index":0,"n_rows":27,"n_cols":1,"rows_kept":27,"cut":false,"hidden":false,"merged":[]}
[]
["Risk Free Interest Rate"]
[{"$f":"Data!B3/1000","v":3.5000000000000003E-2}]
[]
["Present Cost of Stock"]
[100]
[]
["Strike Price"]
[110]
[]
["Time to Maturity (yrs)"]
[{"$f":"Data!B12/100","v":3}]
[]
["Volatility of Market"]
[{"$f":"Data!B15/1000","v":0.2}]
[]
["ECO / EPO"]
[]
[]
["Dividend?"]
[10]
[]
["Dividend Yield (δ)"]
[{"$f":"(IF(Data!C5,LN(A6/(A6-A21*EXP(-1*A3))),\"n/a\"))","v":"n/a"}]
[]
["Value of Option"]
[{"$f":"IF(Data!C5,IF(Data!C4,A6*Data!C26*EXP(-1*A24*A12)-EXP(-1*A3*A12)*A9*Data!C27,-1*A6*EXP(-1*A24*A12)*Data!C28+EXP(-1*A3*A12)*A9*Data!C29),IF(Data!C4,A6*Data!C22-EXP(-1*A3*A12)*A9*Data!C23,-1*A6*Data!C24+EXP(-1*A3*A12)*A9*Data!C25))","v":14.172127723621529}]

{"sheet":"Option vs Time","index":1,"n_rows":27,"n_cols":1,"rows_kept":27,"cut":false,"hidden":false,"merged":[]}
[]
["Risk Free Interest Rate"]
[{"$f":"Data!B3/1000","v":3.5000000000000003E-2}]
[]
["Present Cost of Stock"]
[100]
[]
["Strike Price"]
[110]
[]
["Time to Maturity (yrs)"]
[{"$f":"Data!A12","v":15}]
[]
["Volatility of Market"]
[{"$f":"Data!B15/1000","v":0.2}]
[]
["ECO / EPO"]
[]
[]
["Dividend?"]
[10]
[]
["Dividend Yield (δ)"]
[{"$f":"(IF(Data!C5,LN(A6/(A6-A21*EXP(-1*A3))),\"n/a\"))","v":"n/a"}]
[]
["Value of Option"]
[{"$f":"IF(Data!C5,IF(Data!C4,A6*Data!P32*EXP(-1*A24*A12)-EXP(-1*A3*A12)*A9*Data!P33,-1*A6*EXP(-1*A24*A12)*Data!R32+EXP(-1*A3*A12)*A9*Data!R33),IF(Data!C4,A6*Data!P28-EXP(-1*A3*A12)*A9*Data!P29,-1*A6*Data!P30+EXP(-1*A3*A12)*A9*Data!P31))","v":45.829310253024104}]

{"sheet":"Other Graphs","index":2,"n_rows":27,"n_cols":1,"rows_kept":27,"cut":false,"hidden":false,"merged":[]}
[]
["Risk Free Interest Rate"]
[{"$f":"Data!B3/1000","v":3.5000000000000003E-2}]
[]
["Present Cost of Stock"]
[110]
[]
["Strike Price"]
[110]
[]
["Time to Maturity (yrs)"]
[{"$f":"Data!B12/100","v":3}]
[]
["Volatility of Market"]
[{"$f":"Data!B15/1000","v":0.2}]
[]
["ECO / EPO"]
[]
[]
["Dividend?"]
[10]
[]
["Dividend Yield (δ)"]
[{"$f":"(IF(Data!C5,LN(A6/(A6-A21*EXP(-1*A3))),\"n/a\"))","v":"n/a"}]
[]
["Value of Option"]
[{"$f":"IF(Data!C5,IF(Data!C4,A6*Data!C26*EXP(-1*A24*A12)-EXP(-1*A3*A12)*A9*Data!C27,-1*A6*EXP(-1*A24*A12)*Data!C28+EXP(-1*A3*A12)*A9*Data!C29),IF(Data!C4,A6*Data!C22-EXP(-1*A3*A12)*A9*Data!C23,-1*A6*Data!C24+EXP(-1*A3*A12)*A9*Data!C25))","v":19.969327560280043}]

{"sheet":"Enter Values","index":3,"n_rows":32,"n_cols":3,"rows_kept":32,"cut":false,"hidden":false,"merged":[]}
[]
["Risk Free Interest Rate"]
[3.5000000000000003E-2,50,"Call?"]
[null,null,true]
["Present Cost of Stock",null,false]
[110]
[]
["Strike Price"]
[110]
[]
["Time to Maturity (yrs)"]
[3,25]
[]
["Volatility of Market"]
[0.2,197]
[]
["ECO / EPO"]
[]
[]
["Dividend?"]
[10]
[null,{"$f":"(LN(A6/A9)+(A3+0.5*A15^2)*A12)/(A15*SQRT(A12))","v":0.47631397208144133},{"$f":"NORMSDIST(B22)","v":0.68307464361323722}]
["Dividend Yield (δ)",{"$f":"B22-A15*SQRT(A12)","v":0.12990381056766587},{"$f":"NORMSDIST(B23)","v":0.55167873527964117}]
[{"$f":"(IF(C5,LN(A6/(A6-A21*EXP(-1*A3))),\"n/a\"))","v":"n/a"},null,{"$f":"NORMSDIST(-1*B22)","v":0.31692535638676278}]
[null,null,{"$f":"NORMSDIST(-1*B23)","v":0.44832126472035883}]
["Value of Option",{"$f":"(LN(A6/A9)+(A3-A24+0.5*A15^2)*A12)/(A15*SQRT(A12))","v":{"$error":"#VALUE!"}},{"$f":"NORMSDIST(B26)","v":{"$error":"#VALUE!"}}]
[{"$f":"IF(C5,IF(C4,A6*C26*EXP(-1*A24*A12)-EXP(-1*A3*A12)*A9*C27,-1*A6*EXP(-1*A24*A12)*C28+EXP(-1*A3*A12)*A9*C29),IF(C4,A6*C22-EXP(-1*A3*A12)*A9*C23,-1*A6*C24+EXP(-1*A3*A12)*A9*C25))","v":20.502322461675945},{"$f":"(LN(A6/A9)+(A3-A24-0.5*A15^2)*A12)/(A15*SQRT(A12))","v":{"$error":"#VALUE!"}},{"$f":"NORMSDIST(B27)","v":{"$error":"#VALUE!"}}]
[null,null,{"$f":"NORMSDIST(-1*B26)","v":{"$error":"#VALUE!"}}]
[null,null,{"$f":"NORMSDIST(-1*B27)","v":{"$error":"#VALUE!"}}]
[]
[null,{"$f":"A6*C22-EXP(-1*A3*A12)*A9*C23","v":20.502322461675945},{"$f":"-1*A6*C24+EXP(-1*A3*A12)*A9*C25","v":9.5380199461651642}]
[null,{"$f":"-1*A6*C24+EXP(-1*A3*A12)*A9*C25","v":9.5380199461651642}]

{"sheet":"Student Guided Sheet","index":4,"n_rows":30,"n_cols":6,"rows_kept":30,"cut":false,"hidden":false,"merged":[]}
["Principal",null,null,"time","Balance","Cont. Balance"]
[null,null,null,0,{"$f":"IF(AND($A$2=0,$A$4=0,$A$6=0,$A$8=0),\"enter values\",$A$2*(1+$A$4/$A$6)^($A$6*D2))","v":"enter values"},{"$f":"IF(AND($A$2=0,$A$4=0,$A$6=0,$A$8=0),\"enter values\",$A$2*EXP($A$4*D2))","v":"enter values"}]
["Interest Rate",null,null,{"$f":"D2+2","v":2},{"$f":"IF(AND($A$2=0,$A$4=0,$A$6=0,$A$8=0),\"enter values\",$A$2*(1+$A$4/$A$6)^($A$6*D3))","v":"enter values"},{"$f":"IF(AND($A$2=0,$A$4=0,$A$6=0,$A$8=0),\"enter values\",$A$2*EXP($A$4*D3))","v":"enter values"}]
[null,null,null,{"$f":"D3+2","v":4},"enter values","enter values"]
["Compounding Periods",null,null,6,"enter values","enter values"]
[null,null,null,8,"enter values","enter values"]
["Time (years)",null,null,10,"enter values","enter values"]
[null,null,null,12,"enter values","enter values"]
["Balance",null,null,14,"enter values","enter values"]
[{"$f":"IF(A6=0,0,A2*(1+A4/A6)^(A6*A8))","v":0},null,null,16,"enter values","enter values"]
[null,null,null,18,"enter values","enter values"]
["Continuous Interest Balance",null,null,20,"enter values","enter values"]
[{"$f":"A2*EXP(A8*A4)","v":0},null,null,22,"enter values","enter values"]
[null,null,null,24,"enter values","enter values"]
[null,null,null,26,"enter values","enter values"]
[null,null,null,28,"enter values","enter values"]
[null,null,null,30,"enter values","enter values"]
[null,null,null,32,"enter values","enter values"]
[null,null,null,34,"enter values","enter values"]
[null,null,null,36,"enter values","enter values"]
[null,null,null,38,"enter values","enter values"]
[null,null,null,40,"enter values","enter values"]
[null,null,null,42,"enter values","enter values"]
[null,null,null,44,"enter values","enter values"]
[null,null,null,46,"enter values","enter values"]
[null,null,null,48,"enter values","enter values"]
[null,null,null,50,"enter values","enter values"]
[null,null,null,52,"enter values","enter values"]
[null,null,null,54,"enter values","enter values"]
[null,null,null,56,"enter values","enter values"]

{"sheet":"Student Designed Sheet","index":5,"n_rows":9,"n_cols":1,"rows_kept":9,"cut":false,"hidden":false,"merged":[]}
["Principal"]
[{"$f":"A10/(1+A4/A6)^(A6*A8)","v":{"$error":"#DIV/0!"}}]
["Interest Rate"]
[]
["Compounding Periods"]
[]
["Time (years)"]
[]
["Balance"]

{"sheet":"Data","index":6,"n_rows":447,"n_cols":21,"rows_kept":447,"cut":false,"hidden":false,"merged":[]}
[null,null,null,"Option vs Cost Data"]
[null,"Time roll","Call? "]
[null,35,null,"S","C","d1","d2","N(d1)","N(d2)","delta C","gamma C","gamma 2"]
[null,null,true,50,{"$f":"IF($C$4,D4*H4-EXP(-1*'Option vs Stock'!$A$3*'Option vs Stock'!$A$12)*'Option vs Stock'!$A$9*I4,-1*D4*H4+EXP(-1*'Option vs Stock'!$A$3*'Option vs Stock'!$A$12)*'Option vs Stock'!$A$9*I4)","v":0.21985435256315955},{"$f":"(LN(D4/'Option vs Stock'!$A$9)+('Option vs Stock'!$A$3+0.5*'Option vs Stock'!$A$15^2)*'Option vs Stock'!$A$12)/('Option vs Stock'!$A$15*SQRT('Option vs Stock'!$A$12))","v":-1.7997663741728245},{"$f":"F4-'Option vs Stock'!$A$15*SQRT('Option vs Stock'!$A$12)","v":-2.1461765356866001},{"$f":"IF($C$4,NORMSDIST(F4),NORMSDIST(-1*F4))","v":3.5948767787602996E-2},{"$f":"IF($C$4,NORMSDIST(G4),NORMSDIST(-1*G4))","v":1.5929448440185606E-2},{"$f":"(E5-E4)/5","v":4.8981725483645502E-2},{"$f":"((H5-H4)/(D5-D4))/(D4*'Option vs Stock'!$A$15*SQRT('Option vs Stock'!$A$12))","v":3.2016369399794276E-4},{"$f":"(J5-J4)/(D5-D4)","v":6.5486767491956064E-3}]
[null,null,false,{"$f":"D4+5","v":55},{"$f":"IF($C$4,D5*H5-EXP(-1*'Option vs Stock'!$A$3*'Option vs Stock'!$A$12)*'Option vs Stock'!$A$9*I5,-1*D5*H5+EXP(-1*'Option vs Stock'!$A$3*'Option vs Stock'!$A$12)*'Option vs Stock'!$A$9*I5)","v":0.46476297998138705},{"$f":"(LN(D5/'Option vs Stock'!$A$9)+('Option vs Stock'!$A$3+0.5*'Option vs Stock'!$A$15^2)*'Option vs Stock'!$A$12)/('Option vs Stock'!$A$15*SQRT('Option vs Stock'!$A$12))","v":-1.5246295843401314},{"$f":"F5-'Option vs Stock'!$A$15*SQRT('Option vs Stock'!$A$12)","v":-1.8710397458539068},6.3675757024771573E-2,3.0669786082505871E-2,{"$f":"(E6-E5)/5","v":8.1725109229623533E-2},{"$f":"((H6-H5)/(D6-D5))/(D5*'Option vs Stock'!$A$15*SQRT('Option vs Stock'!$A$12))","v":3.9630955917701547E-4},{"$f":"(J6-J5)/(D6-D5)","v":8.5127008145510531E-3}]
[null,null,"Dividend?",60,{"$f":"IF($C$4,D6*H6-EXP(-1*'Option vs Stock'!$A$3*'Option vs Stock'!$A$12)*'Option vs Stock'!$A$9*I6,-1*D6*H6+EXP(-1*'Option vs Stock'!$A$3*'Option vs Stock'!$A$12)*'Option vs Stock'!$A$9*I6)","v":0.87338852612950468},{"$f":"(LN(D6/'Option vs Stock'!$A$9)+('Option vs Stock'!$A$3+0.5*'Option vs Stock'!$A$15^2)*'Option vs Stock'!$A$12)/('Option vs Stock'!$A$15*SQRT('Option vs Stock'!$A$12))","v":-1.2734493747025177},{"$f":"F6-'Option vs Stock'!$A$15*SQRT('Option vs Stock'!$A$12)","v":-1.6198595362162931},0.10142931308586142,5.2631226834531378E-2,0.12428861330237879,{"$f":"((H7-H6)/(D7-D6))/(D6*'Option vs Stock'!$A$15*SQRT('Option vs Stock'!$A$12))","v":4.540577805361592E-4},1.0259290594237955E-2]
[null,null,null,65,{"$f":"IF($C$4,D7*H7-EXP(-1*'Option vs Stock'!$A$3*'Option vs Stock'!$A$12)*'Option vs Stock'!$A$9*I7,-1*D7*H7+EXP(-1*'Option vs Stock'!$A$3*'Option vs Stock'!$A$12)*'Option vs Stock'!$A$9*I7)","v":1.4948315926413986},{"$f":"(LN(D7/'Option vs Stock'!$A$9)+('Option vs Stock'!$A$3+0.5*'Option vs Stock'!$A$15^2)*'Option vs Stock'!$A$12)/('Option vs Stock'!$A$15*SQRT('Option vs Stock'!$A$12))","v":-1.0423859805926037},{"$f":"F7-'Option vs Stock'!$A$15*SQRT('Option vs Stock'!$A$12)","v":-1.3887961421063792},0.14861638181349662,8.2447374357258463E-2,0.17558506627356857,{"$f":"((H8-H7)/(D8-D7))/(D7*'Option vs Stock'!$A$15*SQRT('Option vs Stock'!$A$12))","v":4.8932780326237525E-4},1.1634610695692582E-2]
[null,null,null,70,{"$f":"IF($C$4,D8*H8-EXP(-1*'Option vs Stock'!$A$3*'Option vs Stock'!$A$12)*'Option vs Stock'!$A$9*I8,-1*D8*H8+EXP(-1*'Option vs Stock'!$A$3*'Option vs Stock'!$A$12)*'Option vs Stock'!$A$9*I8)","v":2.3727569240092414},{"$f":"(LN(D8/'Option vs Stock'!$A$9)+('Option vs Stock'!$A$3+0.5*'Option vs Stock'!$A$15^2)*'Option vs Stock'!$A$12)/('Option vs Stock'!$A$15*SQRT('Option vs Stock'!$A$12))","v":-0.82845469223236079},{"$f":"F8-'Option vs Stock'!$A$15*SQRT('Option vs Stock'!$A$12)","v":-1.1748648537461364},0.20370652190591923,0.12002439434797514,0.23375811975203148,{"$f":"((H9-H8)/(D9-D8))/(D8*'Option vs Stock'!$A$15*SQRT('Option vs Stock'!$A$12))","v":5.0207430095598477E-4},1.2557552471421906E-2]
[null,null,null,75,{"$f":"IF($C$4,D9*H9-EXP(-1*'Option vs Stock'!$A$3*'Option vs Stock'!$A$12)*'Option vs Stock'!$A$9*I9,-1*D9*H9+EXP(-1*'Option vs Stock'!$A$3*'Option vs Stock'!$A$12)*'Option vs Stock'!$A$9*I9)","v":3.5415475227693989},{"$f":"(LN(D9/'Option vs Stock'!$A$9)+('Option vs Stock'!$A$3+0.5*'Option vs Stock'!$A$15^2)*'Option vs Stock'!$A$12)/('Option vs Stock'!$A$15*SQRT('Option vs Stock'!$A$12))","v":-0.62928942760657747},{"$f":"F9-'Option vs Stock'!$A$15*SQRT('Option vs Stock'!$A$12)","v":-0.97569958912035293},0.26457979579604674,0.1646066779555653,0.29654588210914101,{"$f":"((H10-H9)/(D10-D9))/(D9*'Option vs Stock'!$A$15*SQRT('Option vs Stock'!$A$12))","v":4.950532589341086E-4},1.3014050309088532E-2]
[null,null,null,80,{"$f":"IF($C$4,D10*H10-EXP(-1*'Option vs Stock'!$A$3*'Option vs Stock'!$A$12)*'Option vs Stock'!$A$9*I10,-1*D10*H10+EXP(-1*'Option vs Stock'!$A$3*'Option vs Stock'!$A$12)*'Option vs Stock'!$A$9*I10)","v":5.0242769333151038},{"$f":"(LN(D10/'Option vs Stock'!$A$9)+('Option vs Stock'!$A$3+0.5*'Option vs Stock'!$A$15^2)*'Option vs Stock'!$A$12)/('Option vs Stock'!$A$15*SQRT('Option vs Stock'!$A$12))","v":-0.4429827648471919},{"$f":"F10-'Option vs Stock'!$A$15*SQRT('Option vs Stock'!$A$12)","v":-0.78939292636096736},0.32888910056552878,0.21494119446436072,0.36161613365458367,{"$f":"((H11-H10)/(D11-D10))/(D10*'Option vs Stock'!$A$15*SQRT('Option vs Stock'!$A$12))","v":4.7249156236619188E-4},1.3040622344122843E-2]
[null,null,null,85,{"$f":"IF($C$4,D11*H11-EXP(-1*'Option vs Stock'!$A$3*'Option vs Stock'!$A$12)*'Option vs Stock'!$A$9*I11,-1*D11*H11+EXP(-1*'Option vs Stock'!$A$3*'Option vs Stock'!$A$12)*'Option vs Stock'!$A$9*I11)","v":6.8323576015880221},{"$f":"(LN(D11/'Option vs Stock'!$A$9)+('Option vs Stock'!$A$3+0.5*'Option vs Stock'!$A$15^2)*'Option vs Stock'!$A$12)/('Option vs Stock'!$A$15*SQRT('Option vs Stock'!$A$12))","v":-0.26797455622100241},{"$f":"F11-'Option vs Stock'!$A$15*SQRT('Option vs Stock'!$A$12)","v":-0.61438471773477787},0.39435945193879623,0.26948056600893344,0.42681924537519789,{"$f":"((H12-H11)/(D12-D11))/(D11*'Option vs Stock'!$A$15*SQRT('Option vs Stock'!$A$12))","v":4.3901018214186744E-4},1.2705054360316704E-2]
[15,300,null,90,{"$f":"IF($C$4,D12*H12-EXP(-1*'Option vs Stock'!$A$3*'Option vs Stock'!$A$12)*'Option vs Stock'!$A$9*I12,-1*D12*H12+EXP(-1*'Option vs Stock'!$A$3*'Option vs Stock'!$A$12)*'Option vs Stock'!$A$9*I12)","v":8.9664538284640116},{"$f":"(LN(D12/'Option vs Stock'!$A$9)+('Option vs Stock'!$A$3+0.5*'Option vs Stock'!$A$15^2)*'Option vs Stock'!$A$12)/('Option vs Stock'!$A$15*SQRT('Option vs Stock'!$A$12))","v":-0.10297242813627042},{"$f":"F12-'Option vs Stock'!$A$15*SQRT('Option vs Stock'!$A$12)","v":-0.44938258965004585},0.45899242688212766,0.3265778442767362,0.4903445171767814,{"$f":"((H13-H12)/(D13-D12))/(D12*'Option vs Stock'!$A$15*SQRT('Option vs Stock'!$A$12))","v":3.9891006877847471E-4},1.2089148935588124E-2]
[null,null,null,95,{"$f":"IF($C$4,D13*H13-EXP(-1*'Option vs Stock'!$A$3*'Option vs Stock'!$A$12)*'Option vs Stock'!$A$9*I13,-1*D13*H13+EXP(-1*'Option vs Stock'!$A$3*'Option vs Stock'!$A$12)*'Option vs Stock'!$A$9*I13)","v":11.418176414347919},{"$f":"(LN(D13/'Option vs Stock'!$A$9)+('Option vs Stock'!$A$3+0.5*'Option vs Stock'!$A$15^2)*'Option vs Stock'!$A$12)/('Option vs Stock'!$A$15*SQRT('Option vs Stock'!$A$12))","v":5.3106195637373316E-2},{"$f":"F13-'Option vs Stock'!$A$15*SQRT('Option vs Stock'!$A$12)","v":-0.29330396587640217},0.52117635249188787,0.38464491127906247,0.55079026185472202,{"$f":"((H14-H13)/(D14-D13))/(D13*'Option vs Stock'!$A$15*SQRT('Option vs Stock'!$A$12))","v":3.5579138123816939E-4},1.1275728609138303E-2]
[null,null,null,100,{"$f":"IF($C$4,D14*H14-EXP(-1*'Option vs Stock'!$A$3*'Option vs Stock'!$A$12)*'Option vs Stock'!$A$9*I14,-1*D14*H14+EXP(-1*'Option vs Stock'!$A$3*'Option vs Stock'!$A$12)*'Option vs Stock'!$A$9*I14)","v":14.172127723621529},{"$f":"(LN(D14/'Option vs Stock'!$A$9)+('Option vs Stock'!$A$3+0.5*'Option vs Stock'!$A$15^2)*'Option vs Stock'!$A$12)/('Option vs Stock'!$A$15*SQRT('Option vs Stock'!$A$12))","v":0.20117718224874831},{"$f":"F14-'Option vs Stock'!$A$15*SQRT('Option vs Stock'!$A$12)","v":-0.14523297926502715},0.57971998366585153,0.44226346413951878,0.60716890490041353,{"$f":"((H15-H14)/(D15-D14))/(D14*'Option vs Stock'!$A$15*SQRT('Option vs Stock'!$A$12))","v":3.124212281029171E-4},1.034022756201125E-2]
[null,200,null,105,{"$f":"IF($C$4,D15*H15-EXP(-1*'Option vs Stock'!$A$3*'Option vs Stock'!$A$12)*'Option vs Stock'!$A$9*I15,-1*D15*H15+EXP(-1*'Option vs Stock'!$A$3*'Option vs Stock'!$A$12)*'Option vs Stock'!$A$9*I15)","v":17.207972248123596},{"$f":"(LN(D15/'Option vs Stock'!$A$9)+('Option vs Stock'!$A$3+0.5*'Option vs Stock'!$A$15^2)*'Option vs Stock'!$A$12)/('Option vs Stock'!$A$15*SQRT('Option vs Stock'!$A$12))","v":0.3420222543338865},{"$f":"F15-'Option vs Stock'!$A$15*SQRT('Option vs Stock'!$A$12)","v":-4.3879071798889613E-3},0.63383292770958333,0.49824948392079421,0.65887004271046978,{"$f":"((H16-H15)/(D16-D15))/(D15*'Option vs Stock'!$A$15*SQRT('Option vs Stock'!$A$12))","v":2.7075921840317762E-4},9.3462201523854434E-3]
[null,null,null,110,{"$f":"IF($C$4,D16*H16-EXP(-1*'Option vs Stock'!$A$3*'Option vs Stock'!$A$12)*'Option vs Stock'!$A$9*I16,-1*D16*H16+EXP(-1*'Option vs Stock'!$A$3*'Option vs Stock'!$A$12)*'Option vs Stock'!$A$9*I16)","v":20.502322461675945},{"$f":"(LN(D16/'Option vs Stock'!$A$9)+('Option vs Stock'!$A$3+0.5*'Option vs Stock'!$A$15^2)*'Option vs Stock'!$A$12)/('Option vs Stock'!$A$15*SQRT('Option vs Stock'!$A$12))","v":0.47631397208144133},{"$f":"F16-'Option vs Stock'!$A$15*SQRT('Option vs Stock'!$A$12)","v":0.12990381056766587},0.68307464361323722,0.55167873527964117,0.705601143472397,{"$f":"((H17-H16)/(D17-D16))/(D16*'Option vs Stock'!$A$15*SQRT('Option vs Stock'!$A$12))","v":2.3206665378590368E-4},8.3438748659659719E-3]
[null,null,null,115,{"$f":"IF($C$4,D17*H17-EXP(-1*'Option vs Stock'!$A$3*'Option vs Stock'!$A$12)*'Option vs Stock'!$A$9*I17,-1*D17*H17+EXP(-1*'Option vs Stock'!$A$3*'Option vs Stock'!$A$12)*'Option vs Stock'!$A$9*I17)","v":24.03032817903793},{"$f":"(LN(D17/'Option vs Stock'!$A$9)+('Option vs Stock'!$A$3+0.5*'Option vs Stock'!$A$15^2)*'Option vs Stock'!$A$12)/('Option vs Stock'!$A$15*SQRT('Option vs Stock'!$A$12))","v":0.60463515751256247},{"$f":"F17-'Option vs Stock'!$A$15*SQRT('Option vs Stock'!$A$12)","v":0.25822499599878701},0.72728927947420219,0.60188336604415804,0.74732051780222686,{"$f":"((H18-H17)/(D18-D17))/(D17*'Option vs Stock'!$A$15*SQRT('Option vs Stock'!$A$12))","v":1.9704754525614972E-4},7.3703290256557528E-3]
[null,null,null,120,{"$f":"IF($C$4,D18*H18-EXP(-1*'Option vs Stock'!$A$3*'Option vs Stock'!$A$12)*'Option vs Stock'!$A$9*I18,-1*D18*H18+EXP(-1*'Option vs Stock'!$A$3*'Option vs Stock'!$A$12)*'Option vs Stock'!$A$9*I18)","v":27.766930768049065},{"$f":"(LN(D18/'Option vs Stock'!$A$9)+('Option vs Stock'!$A$3+0.5*'Option vs Stock'!$A$15^2)*'Option vs Stock'!$A$12)/('Option vs Stock'!$A$15*SQRT('Option vs Stock'!$A$12))","v":0.72749418171905489},{"$f":"F18-'Option vs Stock'!$A$15*SQRT('Option vs Stock'!$A$12)","v":0.38108402020527943},0.76653836086159577,0.64842954779411821,0.78417216293050562,{"$f":"((H19-H18)/(D19-D18))/(D18*'Option vs Stock'!$A$15*SQRT('Option vs Stock'!$A$12))","v":1.6598974700174284E-4},6.4511559884601775E-3]
[null,null,null,125,{"$f":"IF($C$4,D19*H19-EXP(-1*'Option vs Stock'!$A$3*'Option vs Stock'!$A$12)*'Option vs Stock'!$A$9*I19,-1*D19*H19+EXP(-1*'Option vs Stock'!$A$3*'Option vs Stock'!$A$12)*'Option vs Stock'!$A$9*I19)","v":31.687791582701593},{"$f":"(LN(D19/'Option vs Stock'!$A$9)+('Option vs Stock'!$A$3+0.5*'Option vs Stock'!$A$15^2)*'Option vs Stock'!$A$12)/('Option vs Stock'!$A$15*SQRT('Option vs Stock'!$A$12))","v":0.84533712934468908},{"$f":"F19-'Option vs Stock'!$A$15*SQRT('Option vs Stock'!$A$12)","v":0.49892696783091361},0.80103868190269845,0.691084582565342,0.81642794287280651,{"$f":"((H20-H19)/(D20-D19))/(D19*'Option vs Stock'!$A$15*SQRT('Option vs Stock'!$A$12))","v":1.3888960446768416E-4},5.6023198883127677E-3]
[null,"Option vs Cost Data",null,130,{"$f":"IF($C$4,D20*H20-EXP(-1*'Option vs Stock'!$A$3*'Option vs Stock'!$A$12)*'Option vs Stock'!$A$9*I20,-1*D20*H20+EXP(-1*'Option vs Stock'!$A$3*'Option vs Stock'!$A$12)*'Option vs Stock'!$A$9*I20)","v":35.769931297065625},{"$f":"(LN(D20/'Option vs Stock'!$A$9)+('Option vs Stock'!$A$3+0.5*'Option vs Stock'!$A$15^2)*'Option vs Stock'!$A$12)/('Option vs Stock'!$A$15*SQRT('Option vs Stock'!$A$12))","v":0.95855757582896917},{"$f":"F20-'Option vs Stock'!$A$15*SQRT('Option vs Stock'!$A$12)","v":0.61214741431519371},0.83110916335034524,0.72977988517522907,0.84443954231437035,{"$f":"((H21-H20)/(D21-D20))/(D20*'Option vs Stock'!$A$15*SQRT('Option vs Stock'!$A$12))","v":1.1555354518406193E-4},4.8322194612057997E-3]
[null,null,null,135,{"$f":"IF($C$4,D21*H21-EXP(-1*'Option vs Stock'!$A$3*'Option vs Stock'!$A$12)*'Option vs Stock'!$A$9*I21,-1*D21*H21+EXP(-1*'Option vs Stock'!$A$3*'Option vs Stock'!$A$12)*'Option vs Stock'!$A$9*I21)","v":39.992129008637477},{"$f":"(LN(D21/'Option vs Stock'!$A$9)+('Option vs Stock'!$A$3+0.5*'Option vs Stock'!$A$15^2)*'Option vs Stock'!$A$12)/('Option vs Stock'!$A$15*SQRT('Option vs Stock'!$A$12))","v":1.0675045184299765},{"$f":"F21-'Option vs Stock'!$A$15*SQRT('Option vs Stock'!$A$12)","v":0.72109435691620105},0.85712796281330039,0.76457426861680067,0.86860063962039935,{"$f":"((H22-H21)/(D22-D21))/(D21*'Option vs Stock'!$A$15*SQRT('Option vs Stock'!$A$12))","v":9.5675993270737775E-5},4.1435866631155619E-3]
[null,{"$f":"(LN('Option vs Stock'!A6/'Option vs Stock'!A9)+('Option vs Stock'!A3+0.5*'Option vs Stock'!A15^2)*'Option vs Stock'!A12)/('Option vs Stock'!A15*SQRT('Option vs Stock'!A12))","v":0.20117718224874831},{"$f":"NORMSDIST(B22)","v":0.57971998366585153},140,{"$f":"IF($C$4,D22*H22-EXP(-1*'Option vs Stock'!$A$3*'Option vs Stock'!$A$12)*'Option vs Stock'!$A$9*I22,-1*D22*H22+EXP(-1*'Option vs Stock'!$A$3*'Option vs Stock'!$A$12)*'Option vs Stock'!$A$9*I22)","v":44.335132206739473},{"$f":"(LN(D22/'Option vs Stock'!$A$9)+('Option vs Stock'!$A$3+0.5*'Option vs Stock'!$A$15^2)*'Option vs Stock'!$A$12)/('Option vs Stock'!$A$15*SQRT('Option vs Stock'!$A$12))","v":1.1724888641892122},{"$f":"F22-'Option vs Stock'!$A$15*SQRT('Option vs Stock'!$A$12)","v":0.8260787026754367},0.87949957980358773,0.79562027599294183,0.88931857293597716,{"$f":"((H23-H22)/(D23-D22))/(D22*'Option vs Stock'!$A$15*SQRT('Option vs Stock'!$A$12))","v":7.8896063640538014E-5},3.5351236402226594E-3]
[null,{"$f":"B22-'Option vs Stock'!A15*SQRT('Option vs Stock'!A12)","v":-0.14523297926502715},{"$f":"NORMSDIST(B23)","v":0.44226346413951878},145,{"$f":"IF($C$4,D23*H23-EXP(-1*'Option vs Stock'!$A$3*'Option vs Stock'!$A$12)*'Option vs Stock'!$A$9*I23,-1*D23*H23+EXP(-1*'Option vs Stock'!$A$3*'Option vs Stock'!$A$12)*'Option vs Stock'!$A$9*I23)","v":48.781725071419359},{"$f":"(LN(D23/'Option vs Stock'!$A$9)+('Option vs Stock'!$A$3+0.5*'Option vs Stock'!$A$15^2)*'Option vs Stock'!$A$12)/('Option vs Stock'!$A$15*SQRT('Option vs Stock'!$A$12))","v":1.2737887788854922},{"$f":"F23-'Option vs Stock'!$A$15*SQRT('Option vs Stock'!$A$12)","v":0.92737861737171678},0.89863085850755164,0.82313500568765219,0.90699419113709046,{"$f":"((H24-H23)/(D24-D23))/(D23*'Option vs Stock'!$A$15*SQRT('Option vs Stock'!$A$12))","v":6.4836730523319558E-5},3.0028391105110909E-3]
[null,null,{"$f":"NORMSDIST(-1*B22)","v":0.42028001633414841},150,{"$f":"IF($C$4,D24*H24-EXP(-1*'Option vs Stock'!$A$3*'Option vs Stock'!$A$12)*'Option vs Stock'!$A$9*I24,-1*D24*H24+EXP(-1*'Option vs Stock'!$A$3*'Option vs Stock'!$A$12)*'Option vs Stock'!$A$9*I24)","v":53.316696027104811},{"$f":"(LN(D24/'Option vs Stock'!$A$9)+('Option vs Stock'!$A$3+0.5*'Option vs Stock'!$A$15^2)*'Option vs Stock'!$A$12)/('Option vs Stock'!$A$15*SQRT('Option vs Stock'!$A$12))","v":1.3716541288149953},{"$f":"F24-'Option vs Stock'!$A$15*SQRT('Option vs Stock'!$A$12)","v":1.0252439673012197},0.91491443266969263,0.84737595639685936,0.92200838668964591,{"$f":"((H25-H24)/(D25-D24))/(D24*'Option vs Stock'!$A$15*SQRT('Option vs Stock'!$A$12))","v":5.3130341157774598E-5},2.5410916288154837E-3]
[null,null,{"$f":"NORMSDIST(-1*B23)","v":0.55773653586048122},155,{"$f":"IF($C$4,D25*H25-EXP(-1*'Option vs Stock'!$A$3*'Option vs Stock'!$A$12)*'Option vs Stock'!$A$9*I25,-1*D25*H25+EXP(-1*'Option vs Stock'!$A$3*'Option vs Stock'!$A$12)*'Option vs Stock'!$A$9*I25)","v":57.926737960553041},{"$f":"(LN(D25/'Option vs Stock'!$A$9)+('Option vs Stock'!$A$3+0.5*'Option vs Stock'!$A$15^2)*'Option vs Stock'!$A$12)/('Option vs Stock'!$A$15*SQRT('Option vs Stock'!$A$12))","v":1.466310193982665},{"$f":"F25-'Option vs Stock'!$A$15*SQRT('Option vs Stock'!$A$12)","v":1.1199000324688897},0.92871810021600265,0.86862181776828884,0.93471384483372333,{"$f":"((H26-H25)/(D26-D25))/(D25*'Option vs Stock'!$A$15*SQRT('Option vs Stock'!$A$12))","v":4.3433980114257775E-5},2.1433716598437515E-3]
[null,{"$f":"(LN('Option vs Stock'!A6/'Option vs Stock'!A9)+('Option vs Stock'!A3-'Option vs Stock'!A24+0.5*'Option vs Stock'!A15^2)*'Option vs Stock'!A12)/('Option vs Stock'!A15*SQRT('Option vs Stock'!A12))","v":{"$error":"#VALUE!"}},{"$f":"NORMSDIST(B26)","v":{"$error":"#VALUE!"}},160,{"$f":"IF($C$4,D26*H26-EXP(-1*'Option vs Stock'!$A$3*'Option vs Stock'!$A$12)*'Option vs Stock'!$A$9*I26,-1*D26*H26+EXP(-1*'Option vs Stock'!$A$3*'Option vs Stock'!$A$12)*'Option vs Stock'!$A$9*I26)","v":62.600307184721657},{"$f":"(LN(D26/'Option vs Stock'!$A$9)+('Option vs Stock'!$A$3+0.5*'Option vs Stock'!$A$15^2)*'Option vs Stock'!$A$12)/('Option vs Stock'!$A$15*SQRT('Option vs Stock'!$A$12))","v":1.5579607915743809},{"$f":"F26-'Option vs Stock'!$A$15*SQRT('Option vs Stock'!$A$12)","v":1.2115506300606054},0.94037872856759142,0.88715777863687473,0.94543070313294209,{"$f":"((H27-H26)/(D27-D26))/(D26*'Option vs Stock'!$A$15*SQRT('Option vs Stock'!$A$12))","v":3.5437604799206952E-5},1.8028644467466437E-3,null,null,null,"Option vs Time Data"]
[null,{"$f":"(LN('Option vs Stock'!A6/'Option vs Stock'!A9)+('Option vs Stock'!A3-'Option vs Stock'!A24-0.5*'Option vs Stock'!A15^2)*'Option vs Stock'!A12)/('Option vs Stock'!A15*SQRT('Option vs Stock'!A12))","v":{"$error":"#VALUE!"}},{"$f":"NORMSDIST(B27)","v":{"$error":"#VALUE!"}},165,{"$f":"IF($C$4,D27*H27-EXP(-1*'Option vs Stock'!$A$3*'Option vs Stock'!$A$12)*'Option vs Stock'!$A$9*I27,-1*D27*H27+EXP(-1*'Option vs Stock'!$A$3*'Option vs Stock'!$A$12)*'Option vs Stock'!$A$9*I27)","v":67.327460700386368},{"$f":"(LN(D27/'Option vs Stock'!$A$9)+('Option vs Stock'!$A$3+0.5*'Option vs Stock'!$A$15^2)*'Option vs Stock'!$A$12)/('Option vs Stock'!$A$15*SQRT('Option vs Stock'!$A$12))","v":1.6467909186476883},{"$f":"F27-'Option vs Stock'!$A$15*SQRT('Option vs Stock'!$A$12)","v":1.300380757133913},0.95019948568931512,0.90326474908061272,0.9544450253666753,{"$f":"((H28-H27)/(D28-D27))/(D27*'Option vs Stock'!$A$15*SQRT('Option vs Stock'!$A$12))","v":2.8867250658756101E-5},1.5128370131662905E-3]
[null,null,{"$f":"NORMSDIST(-1*B26)","v":{"$error":"#VALUE!"}},170,{"$f":"IF($C$4,D28*H28-EXP(-1*'Option vs Stock'!$A$3*'Option vs Stock'!$A$12)*'Option vs Stock'!$A$9*I28,-1*D28*H28+EXP(-1*'Option vs Stock'!$A$3*'Option vs Stock'!$A$12)*'Option vs Stock'!$A$9*I28)","v":72.099685827219744},{"$f":"(LN(D28/'Option vs Stock'!$A$9)+('Option vs Stock'!$A$3+0.5*'Option vs Stock'!$A$15^2)*'Option vs Stock'!$A$12)/('Option vs Stock'!$A$15*SQRT('Option vs Stock'!$A$12))","v":1.7329690002005702},{"$f":"F28-'Option vs Stock'!$A$15*SQRT('Option vs Stock'!$A$12)","v":1.3865588386867946},0.95844941058392075,0.91721183653271543,0.96200921043250676,{"$f":"((H29-H28)/(D29-D28))/(D28*'Option vs Stock'!$A$15*SQRT('Option vs Stock'!$A$12))","v":2.3485037276775619E-5},1.2668892294396938E-3,null,null,{"$f":"(LN('Option vs Time'!A6/'Option vs Time'!A9)+('Option vs Time'!A3+0.5*'Option vs Time'!A15^2)*'Option vs Time'!A12)/('Option vs Time'!A15*SQRT('Option vs Time'!A12))","v":0.94202550717164479},{"$f":"NORMSDIST(O28)","v":0.82691020952341499}]
[null,null,{"$f":"NORMSDIST(-1*B27)","v":{"$error":"#VALUE!"}},175,{"$f":"IF($C$4,D29*H29-EXP(-1*'Option vs Stock'!$A$3*'Option vs Stock'!$A$12)*'Option vs Stock'!$A$9*I29,-1*D29*H29+EXP(-1*'Option vs Stock'!$A$3*'Option vs Stock'!$A$12)*'Option vs Stock'!$A$9*I29)","v":76.909731879382278},{"$f":"(LN(D29/'Option vs Stock'!$A$9)+('Option vs Stock'!$A$3+0.5*'Option vs Stock'!$A$15^2)*'Option vs Stock'!$A$12)/('Option vs Stock'!$A$15*SQRT('Option vs Stock'!$A$12))","v":1.8166488112851524},{"$f":"F29-'Option vs Stock'!$A$15*SQRT('Option vs Stock'!$A$12)","v":1.4702386497713769},0.96536454780669489,0.92925143482937289,0.96834365657970523,{"$f":"((H30-H29)/(D30-D29))/(D29*'Option vs Stock'!$A$15*SQRT('Option vs Stock'!$A$12))","v":1.9087231166416028E-5},1.0591032872923733E-3,null,null,{"$f":"O28-'Option vs Time'!A15*SQRT('Option vs Time'!A12)","v":0.16742883793016139},{"$f":"NORMSDIST(O29)","v":0.56648368198228471}]
[null,null,null,180,{"$f":"IF($C$4,D30*H30-EXP(-1*'Option vs Stock'!$A$3*'Option vs Stock'!$A$12)*'Option vs Stock'!$A$9*I30,-1*D30*H30+EXP(-1*'Option vs Stock'!$A$3*'Option vs Stock'!$A$12)*'Option vs Stock'!$A$9*I30)","v":81.751450162280804},{"$f":"(LN(D30/'Option vs Stock'!$A$9)+('Option vs Stock'!$A$3+0.5*'Option vs Stock'!$A$15^2)*'Option vs Stock'!$A$12)/('Option vs Stock'!$A$15*SQRT('Option vs Stock'!$A$12))","v":1.8979711282853027},{"$f":"F30-'Option vs Stock'!$A$15*SQRT('Option vs Stock'!$A$12)","v":1.5515609667715271},0.97115005728400272,0.93961634554463414,0.97363917301616709,{"$f":"((H31-H30)/(D31-D30))/(D30*'Option vs Stock'!$A$15*SQRT('Option vs Stock'!$A$12))","v":1.5501244416481161E-5},8.8411973589699324E-4,null,null,null,{"$f":"NORMSDIST(-1*O28)","v":0.17308979047658504}]
[null,{"$f":"'Option vs Stock'!A6*C22-EXP(-1*'Option vs Stock'!A3*'Option vs Stock'!A12)*'Option vs Stock'!A9*C23","v":14.172127723621529},{"$f":"-1*'Option vs Stock'!A6*C24+EXP(-1*'Option vs Stock'!A3*'Option vs Stock'!A12)*'Option vs Stock'!A9*C25","v":13.207825208110755},185,{"$f":"IF($C$4,D31*H31-EXP(-1*'Option vs Stock'!$A$3*'Option vs Stock'!$A$12)*'Option vs Stock'!$A$9*I31,-1*D31*H31+EXP(-1*'Option vs Stock'!$A$3*'Option vs Stock'!$A$12)*'Option vs Stock'!$A$9*I31)","v":86.61964602736164},{"$f":"(LN(D31/'Option vs Stock'!$A$9)+('Option vs Stock'!$A$3+0.5*'Option vs Stock'!$A$15^2)*'Option vs Stock'!$A$12)/('Option vs Stock'!$A$15*SQRT('Option vs Stock'!$A$12))","v":1.9770651539004396},{"$f":"F31-'Option vs Stock'!$A$15*SQRT('Option vs Stock'!$A$12)","v":1.6306549923866642},0.9759828670077827,0.94851843077886566,0.97805977169565206,{"$f":"((H32-H31)/(D32-D31))/(D31*'Option vs Stock'!$A$15*SQRT('Option vs Stock'!$A$12))","v":1.2582162191390741E-5},7.3716231434162172E-4,null,null,null,{"$f":"NORMSDIST(-1*O29)","v":0.43351631801771523}]
[null,{"$f":"-1*'Option vs Stock'!A6*C24+EXP(-1*'Option vs Stock'!A3*'Option vs Stock'!A12)*'Option vs Stock'!A9*C25","v":13.207825208110755},null,190,{"$f":"IF($C$4,D32*H32-EXP(-1*'Option vs Stock'!$A$3*'Option vs Stock'!$A$12)*'Option vs Stock'!$A$9*I32,-1*D32*H32+EXP(-1*'Option vs Stock'!$A$3*'Option vs Stock'!$A$12)*'Option vs Stock'!$A$9*I32)","v":91.5099448858399},{"$f":"(LN(D32/'Option vs Stock'!$A$9)+('Option vs Stock'!$A$3+0.5*'Option vs Stock'!$A$15^2)*'Option vs Stock'!$A$12)/('Option vs Stock'!$A$15*SQRT('Option vs Stock'!$A$12))","v":2.0540497520589462},{"$f":"F32-'Option vs Stock'!$A$15*SQRT('Option vs Stock'!$A$12)","v":1.7076395905451709},0.98001456168192647,0.95614838122947265,0.98174558326736017,{"$f":"((H33-H32)/(D33-D32))/(D32*'Option vs Stock'!$A$15*SQRT('Option vs Stock'!$A$12))","v":1.0209182013480087E-5},6.1402860193540134E-4,null,null,{"$f":"(LN('Option vs Time'!A6/'Option vs Time'!A9)+('Option vs Time'!A3-'Option vs Time'!A24+0.5*'Option vs Time'!A15^2)*'Option vs Time'!A12)/('Option vs Time'!A15*SQRT('Option vs Time'!A12))","v":{"$error":"#VALUE!"}},{"$f":"NORMSDIST(O32)","v":{"$error":"#VALUE!"}},null,{"$f":"NORMSDIST(-O32)","v":{"$error":"#VALUE!"}}]
[null,null,null,195,{"$f":"IF($C$4,D33*H33-EXP(-1*'Option vs Stock'!$A$3*'Option vs Stock'!$A$12)*'Option vs Stock'!$A$9*I33,-1*D33*H33+EXP(-1*'Option vs Stock'!$A$3*'Option vs Stock'!$A$12)*'Option vs Stock'!$A$9*I33)","v":96.418672802176701},{"$f":"(LN(D33/'Option vs Stock'!$A$9)+('Option vs Stock'!$A$3+0.5*'Option vs Stock'!$A$15^2)*'Option vs Stock'!$A$12)/('Option vs Stock'!$A$15*SQRT('Option vs Stock'!$A$12))","v":2.1290345223952163},{"$f":"F33-'Option vs Stock'!$A$15*SQRT('Option vs Stock'!$A$12)","v":1.7826243608814409},0.98337429785262898,0.96267626422298702,0.98481572627703717,{"$f":"((H34-H33)/(D34-D33))/(D33*'Option vs Stock'!$A$15*SQRT('Option vs Stock'!$A$12))","v":8.282198236918725E-6},-4.2506732025978824,null,null,{"$f":"(LN('Option vs Time'!A6/'Option vs Time'!A9)+('Option vs Time'!A3-'Option vs Time'!A24-0.5*'Option vs Time'!A15^2)*'Option vs Time'!A12)/('Option vs Time'!A15*SQRT('Option vs Time'!A12))","v":{"$error":"#VALUE!"}},{"$f":"NORMSDIST(O33)","v":{"$error":"#VALUE!"}},null,{"$f":"NORMSDIST(-O33)","v":{"$error":"#VALUE!"}}]
[null,null,null,200,{"$f":"IF($C$4,D34*H34-EXP(-1*'Option vs Stock'!$A$3*'Option vs Stock'!$A$12)*'Option vs Stock'!$A$9*I34,-1*D34*H34+EXP(-1*'Option vs Stock'!$A$3*'Option vs Stock'!$A$12)*'Option vs Stock'!$A$9*I34)","v":101.34275143356189},{"$f":"(LN(D34/'Option vs Stock'!$A$9)+('Option vs Stock'!$A$3+0.5*'Option vs Stock'!$A$15^2)*'Option vs Stock'!$A$12)/('Option vs Stock'!$A$15*SQRT('Option vs Stock'!$A$12))","v":2.2021207386703212},{"$f":"F34-'Option vs Stock'!$A$15*SQRT('Option vs Stock'!$A$12)","v":1.8557105771565459},0.9861716095408456,0.96825258881652831,-20.268550286712376,{"$f":"((H35-H34)/(D35-D34))/(D34*'Option vs Stock'!$A$15*SQRT('Option vs Stock'!$A$12))","v":7.1170805529446733E-5},-0.10134275143356188]
[]
[null,null,null,null,"Other data"]
[null,null,null,"t","C (time)","d1(time)","d2(time)","N(d1) time","N(d2) time","sigma1","sigma2",null,null,null,"t","C (time)","d1(time)","d2(time)","N(d1) time","N(d2) time","dC"]
[null,null,null,9.9999999999999995E-7,{"$f":"IF($C$4, 'Other Graphs'!$A$6*H38-EXP(-1*'Other Graphs'!$A$3*D38)*'Other Graphs'!$A$9*I38,-1*'Other Graphs'!$A$6*H38+EXP(-1*'Other Graphs'!$A$3*D38)*'Other Graphs'!$A$9*I38)","v":8.7786551349680053E-3},{"$f":"(LN('Other Graphs'!$A$6/'Other Graphs'!$A$9)+('Other Graphs'!$A$3+0.5*'Other Graphs'!$A$15^2)*D38)/('Other Graphs'!$A$15*SQRT(D38))","v":2.7500000000000002E-4},{"$f":"F38-'Other Graphs'!$A$15*SQRT(D38)","v":7.5000000000000007E-5},{"$f":"IF($C$4,NORMSDIST(F38),NORMSDIST(-1*F38))","v":0.50010970912572761},{"$f":"IF($C$4,NORMSDIST(G38),NORMSDIST(-1*G38))","v":0.50002992067100205},{"$f":"(F38*SQRT(D38)+SQRT(F38^2*D38-2*D38*LN('Other Graphs'!$A$6/'Other Graphs'!$A$9)-2*D38^2*'Other Graphs'!$A$3))/D38","v":0.35000000000000003},{"$f":"(F38*SQRT(D38)-SQRT(F38^2*D38-2*D38*LN('Other Graphs'!$A$6/'Other Graphs'!$A$9)-2*Data!D38^2*'Other Graphs'!$A$3))/D38","v":0.2},null,null,null,9.9999999999999995E-7,{"$f":"IF($C$4, 'Option vs Time'!$A$6*S38-EXP(-1*'Option vs Time'!$A$3*O38)*'Option vs Time'!$A$9*T38,-1*'Option vs Time'!$A$6*S38+EXP(-1*'Option vs Time'!$A$3*O38)*'Option vs Time'!$A$9*T38)","v":0},{"$f":"(LN('Option vs Time'!$A$6/'Option vs Time'!$A$9)+('Option vs Time'!$A$3+0.5*'Option vs Time'!$A$15^2)*O38)/('Option vs Time'!$A$15*SQRT(O38))","v":-476.55062402162446},{"$f":"Q38-'Option vs Time'!$A$15*SQRT(O38)","v":-476.55082402162446},{"$f":"IF($C$4,NORMSDIST(Q38),NORMSDIST(-1*Q38))","v":0},{"$f":"IF($C$4,NORMSDIST(R38),NORMSDIST(-1*R38))","v":0},{"$f":"(P39-P38)/(O39-O38)","v":5.4741140610500105}]
[null,null,null,1.0000009999999999,{"$f":"IF($C$4, 'Other Graphs'!$A$6*H39-EXP(-1*'Other Graphs'!$A$3*D39)*'Other Graphs'!$A$9*I39,-1*'Other Graphs'!$A$6*H39+EXP(-1*'Other Graphs'!$A$3*D39)*'Other Graphs'!$A$9*I39)","v":10.634220303972135},{"$f":"(LN('Other Graphs'!$A$6/'Other Graphs'!$A$9)+('Other Graphs'!$A$3+0.5*'Other Graphs'!$A$15^2)*D39)/('Other Graphs'!$A$15*SQRT(D39))","v":0.2750001374999656},{"$f":"F39-'Other Graphs'!$A$15*SQRT(D39)","v":7.5000037499990568E-2},{"$f":"IF($C$4,NORMSDIST(F39),NORMSDIST(-1*F39))","v":0.6083419336654815},{"$f":"IF($C$4,NORMSDIST(G39),NORMSDIST(-1*G39))","v":0.52989265897120963},{"$f":"(F39*SQRT(D39)+SQRT(F39^2*D39-2*D39*LN('Other Graphs'!$A$6/'Other Graphs'!$A$9)-2*Data!D39^2*'Other Graphs'!$A$3))/D39","v":0.34999999999999987},{"$f":"(F39*SQRT(D39)-SQRT(F39^2*D39-2*D39*LN('Other Graphs'!$A$6/'Other Graphs'!$A$9)-2*Data!D39^2*'Other Graphs'!$A$3))/D39","v":0.20000000000000021},null,null,null,1.0000009999999999,{"$f":"IF($C$4, 'Option vs Time'!$A$6*S39-EXP(-1*'Option vs Time'!$A$3*O39)*'Option vs Time'!$A$9*T39,-1*'Option vs Time'!$A$6*S39+EXP(-1*'Option vs Time'!$A$3*O39)*'Option vs Time'!$A$9*T39)","v":5.4741140610500096},{"$f":"(LN('Option vs Time'!$A$6/'Option vs Time'!$A$9)+('Option vs Time'!$A$3+0.5*'Option vs Time'!$A$15^2)*O39)/('Option vs Time'!$A$15*SQRT(O39))","v":-0.20155052324638797},{"$f":"Q39-'Option vs Time'!$A$15*SQRT(O39)","v":-0.40155062324636304},{"$f":"IF($C$4,NORMSDIST(Q39),NORMSDIST(-1*Q39))","v":0.42013406401817666},{"$f":"IF($C$4,NORMSDIST(R39),NORMSDIST(-1*R39))","v":0.34400738743744114},{"$f":"(P40-P39)/(O40-O39)","v":4.6799293215543889}]
[null,null,null,2.0000010000000001,{"$f":"IF($C$4, 'Other Graphs'!$A$6*H40-EXP(-1*'Other Graphs'!$A$3*D40)*'Other Graphs'!$A$9*I40,-1*'Other Graphs'!$A$6*H40+EXP(-1*'Other Graphs'!$A$3*D40)*'Other Graphs'!$A$9*I40)","v":16.032680002805058},{"$f":"(LN('Other Graphs'!$A$6/'Other Graphs'!$A$9)+('Other Graphs'!$A$3+0.5*'Other Graphs'!$A$15^2)*D40)/('Other Graphs'!$A$15*SQRT(D40))","v":0.38890882687977146},{"$f":"F40-'Other Graphs'!$A$15*SQRT(D40)","v":0.10606604369448314},0.65132820385037715,0.54223502383083,{"$f":"(F40*SQRT(D40)+SQRT(F40^2*D40-2*D40*LN('Other Graphs'!$A$6/'Other Graphs'!$A$9)-2*Data!D40^2*'Other Graphs'!$A$3))/D40","v":0.3500000000000002},{"$f":"(F40*SQRT(D40)-SQRT(F40^2*D40-2*D40*LN('Other Graphs'!$A$6/'Other Graphs'!$A$9)-2*Data!D40^2*'Other Graphs'!$A$3))/D40","v":0.19999999999999993},null,null,null,2.0000010000000001,{"$f":"IF($C$4, 'Option vs Time'!$A$6*S40-EXP(-1*'Option vs Time'!$A$3*O40)*'Option vs Time'!$A$9*T40,-1*'Option vs Time'!$A$6*S40+EXP(-1*'Option vs Time'!$A$3*O40)*'Option vs Time'!$A$9*T40)","v":10.154043382604399},{"$f":"(LN('Option vs Time'!$A$6/'Option vs Time'!$A$9)+('Option vs Time'!$A$3+0.5*'Option vs Time'!$A$15^2)*O40)/('Option vs Time'!$A$15*SQRT(O40))","v":5.1936538844096651E-2},{"$f":"Q40-'Option vs Time'!$A$15*SQRT(O40)","v":-0.23090624434119167},0.52071037011824028,0.40869381976718278,4.0180881311653991]
[null,null,null,3.0000010000000001,{"$f":"IF($C$4, 'Other Graphs'!$A$6*H41-EXP(-1*'Other Graphs'!$A$3*D41)*'Other Graphs'!$A$9*I41,-1*'Other Graphs'!$A$6*H41+EXP(-1*'Other Graphs'!$A$3*D41)*'Other Graphs'!$A$9*I41)","v":20.502326635849712},{"$f":"(LN('Other Graphs'!$A$6/'Other Graphs'!$A$9)+('Other Graphs'!$A$3+0.5*'Other Graphs'!$A$15^2)*D41)/('Other Graphs'!$A$15*SQRT(D41))","v":0.47631405146709671},{"$f":"F41-'Other Graphs'!$A$15*SQRT(D41)","v":0.1299038322182991},0.6830746718872085,0.55167874384442306,{"$f":"(F41*SQRT(D41)+SQRT(F41^2*D41-2*D41*LN('Other Graphs'!$A$6/'Other Graphs'!$A$9)-2*Data!D41^2*'Other Graphs'!$A$3))/D41","v":0.35000000000000009},{"$f":"(F41*SQRT(D41)-SQRT(F41^2*D41-2*D41*LN('Other Graphs'!$A$6/'Other Graphs'!$A$9)-2*Data!D41^2*'Other Graphs'!$A$3))/D41","v":0.19999999999999998},null,null,null,3.0000010000000001,{"$f":"IF($C$4, 'Option vs Time'!$A$6*S41-EXP(-1*'Option vs Time'!$A$3*O41)*'Option vs Time'!$A$9*T41,-1*'Option vs Time'!$A$6*S41+EXP(-1*'Option vs Time'!$A$3*O41)*'Option vs Time'!$A$9*T41)","v":14.172131513769799},{"$f":"(LN('Option vs Time'!$A$6/'Option vs Time'!$A$9)+('Option vs Time'!$A$3+0.5*'Option vs Time'!$A$15^2)*O41)/('Option vs Time'!$A$15*SQRT(O41))","v":0.20117730749052384},{"$f":"Q41-'Option vs Time'!$A$15*SQRT(O41)","v":-0.14523291175827377},0.57972003262916916,0.44226349078828375,3.6140693050187309]
[null,null,null,4.0000010000000001,{"$f":"IF($C$4, 'Other Graphs'!$A$6*H42-EXP(-1*'Other Graphs'!$A$3*D42)*'Other Graphs'!$A$9*I42,-1*'Other Graphs'!$A$6*H42+EXP(-1*'Other Graphs'!$A$3*D42)*'Other Graphs'!$A$9*I42)","v":24.456530763465651},{"$f":"(LN('Other Graphs'!$A$6/'Other Graphs'!$A$9)+('Other Graphs'!$A$3+0.5*'Other Graphs'!$A$15^2)*D42)/('Other Graphs'!$A$15*SQRT(D42))","v":0.55000006874999574},{"$f":"F42-'Other Graphs'!$A$15*SQRT(D42)","v":0.15000001874999885},0.70884033678904179,0.55961769976672948,{"$f":"(F42*SQRT(D42)+SQRT(F42^2*D42-2*D42*LN('Other Graphs'!$A$6/'Other Graphs'!$A$9)-2*Data!D42^2*'Other Graphs'!$A$3))/D42","v":0.35000000000000003},{"$f":"(F42*SQRT(D42)-SQRT(F42^2*D42-2*D42*LN('Other Graphs'!$A$6/'Other Graphs'!$A$9)-2*Data!D42^2*'Other Graphs'!$A$3))/D42","v":0.19999999999999993},null,null,null,4.0000010000000001,{"$f":"IF($C$4, 'Option vs Time'!$A$6*S42-EXP(-1*'Option vs Time'!$A$3*O42)*'Option vs Time'!$A$9*T42,-1*'Option vs Time'!$A$6*S42+EXP(-1*'Option vs Time'!$A$3*O42)*'Option vs Time'!$A$9*T42)","v":17.786200818788529},{"$f":"(LN('Option vs Time'!$A$6/'Option vs Time'!$A$9)+('Option vs Time'!$A$3+0.5*'Option vs Time'!$A$15^2)*O42)/('Option vs Time'!$A$15*SQRT(O42))","v":0.31172464902360913},{"$f":"Q42-'Option vs Time'!$A$15*SQRT(O42)","v":-8.8275400976387752E-2},0.62237510324241929,0.46482889489643159,3.3244962180440893]
[null,null,null,5.0000010000000001,{"$f":"IF($C$4, 'Other Graphs'!$A$6*H43-EXP(-1*'Other Graphs'!$A$3*D43)*'Other Graphs'!$A$9*I43,-1*'Other Graphs'!$A$6*H43+EXP(-1*'Other Graphs'!$A$3*D43)*'Other Graphs'!$A$9*I43)","v":28.057247978119968},{"$f":"(LN('Other Graphs'!$A$6/'Other Graphs'!$A$9)+('Other Graphs'!$A$3+0.5*'Other Graphs'!$A$15^2)*D43)/('Other Graphs'!$A$15*SQRT(D43))","v":0.61491875530430851},{"$f":"F43-'Other Graphs'!$A$15*SQRT(D43)","v":0.16770511508299324},0.73069581196513345,0.56659236403332769,{"$f":"(F43*SQRT(D43)+SQRT(F43^2*D43-2*D43*LN('Other Graphs'!$A$6/'Other Graphs'!$A$9)-2*Data!D43^2*'Other Graphs'!$A$3))/D43","v":0.35000000000000003},{"$f":"(F43*SQRT(D43)-SQRT(F43^2*D43-2*D43*LN('Other Graphs'!$A$6/'Other Graphs'!$A$9)-2*Data!D43^2*'Other Graphs'!$A$3))/D43","v":0.2},null,null,null,5.0000010000000001,{"$f":"IF($C$4, 'Option vs Time'!$A$6*S43-EXP(-1*'Option vs Time'!$A$3*O43)*'Option vs Time'!$A$9*T43,-1*'Option vs Time'!$A$6*S43+EXP(-1*'Option vs Time'!$A$3*O43)*'Option vs Time'!$A$9*T43)","v":21.110697036832619},{"$f":"(LN('Option vs Time'!$A$6/'Option vs Time'!$A$9)+('Option vs Time'!$A$3+0.5*'Option vs Time'!$A$15^2)*O43)/('Option vs Time'!$A$15*SQRT(O43))","v":0.40179873562611135},{"$f":"Q43-'Option vs Time'!$A$15*SQRT(O43)","v":-4.541490459520392E-2},0.65608392362793722,0.48188830054809545,3.0978886018427545]
[null,null,null,6.0000010000000001,{"$f":"IF($C$4, 'Other Graphs'!$A$6*H44-EXP(-1*'Other Graphs'!$A$3*D44)*'Other Graphs'!$A$9*I44,-1*'Other Graphs'!$A$6*H44+EXP(-1*'Other Graphs'!$A$3*D44)*'Other Graphs'!$A$9*I44)","v":31.3887879485601},{"$f":"(LN('Other Graphs'!$A$6/'Other Graphs'!$A$9)+('Other Graphs'!$A$3+0.5*'Other Graphs'!$A$15^2)*D44)/('Other Graphs'!$A$15*SQRT(D44))","v":0.67360973539951163},{"$f":"F44-'Other Graphs'!$A$15*SQRT(D44)","v":0.18371174601804863},0.74972026893962884,0.57288020312128463,{"$f":"(F44*SQRT(D44)+SQRT(F44^2*D44-2*D44*LN('Other Graphs'!$A$6/'Other Graphs'!$A$9)-2*Data!D44^2*'Other Graphs'!$A$3))/D44","v":0.35000000000000003},{"$f":"(F44*SQRT(D44)-SQRT(F44^2*D44-2*D44*LN('Other Graphs'!$A$6/'Other Graphs'!$A$9)-2*Data!D44^2*'Other Graphs'!$A$3))/D44","v":0.2},null,null,null,6.0000010000000001,{"$f":"IF($C$4, 'Option vs Time'!$A$6*S44-EXP(-1*'Option vs Time'!$A$3*O44)*'Option vs Time'!$A$9*T44,-1*'Option vs Time'!$A$6*S44+EXP(-1*'Option vs Time'!$A$3*O44)*'Option vs Time'!$A$9*T44)","v":24.208585638675373},{"$f":"(LN('Option vs Time'!$A$6/'Option vs Time'!$A$9)+('Option vs Time'!$A$3+0.5*'Option vs Time'!$A$15^2)*O44)/('Option vs Time'!$A$15*SQRT(O44))","v":0.47905866176750528},{"$f":"Q44-'Option vs Time'!$A$15*SQRT(O44)","v":-1.0839327613957728E-2},0.68405155154937658,0.49567581859925147,2.9106638844776853]
[null,null,null,7.0000010000000001,{"$f":"IF($C$4, 'Other Graphs'!$A$6*H45-EXP(-1*'Other Graphs'!$A$3*D45)*'Other Graphs'!$A$9*I45,-1*'Other Graphs'!$A$6*H45+EXP(-1*'Other Graphs'!$A$3*D45)*'Other Graphs'!$A$9*I45)","v":34.502176198517645},{"$f":"(LN('Other Graphs'!$A$6/'Other Graphs'!$A$9)+('Other Graphs'!$A$3+0.5*'Other Graphs'!$A$15^2)*D45)/('Other Graphs'!$A$15*SQRT(D45))","v":0.72758166251287559},{"$f":"F45-'Other Graphs'!$A$15*SQRT(D45)","v":0.19843136250351145},0.76656514540607601,0.57864620922727272,{"$f":"(F45*SQRT(D45)+SQRT(F45^2*D45-2*D45*LN('Other Graphs'!$A$6/'Other Graphs'!$A$9)-2*Data!D45^2*'Other Graphs'!$A$3))/D45","v":0.34999999999999992},{"$f":"(F45*SQRT(D45)-SQRT(F45^2*D45-2*D45*LN('Other Graphs'!$A$6/'Other Graphs'!$A$9)-2*Data!D45^2*'Other Graphs'!$A$3))/D45","v":0.20000000000000012},null,null,null,7.0000010000000001,{"$f":"IF($C$4, 'Option vs Time'!$A$6*S45-EXP(-1*'Option vs Time'!$A$3*O45)*'Option vs Time'!$A$9*T45,-1*'Option vs Time'!$A$6*S45+EXP(-1*'Option vs Time'!$A$3*O45)*'Option vs Time'!$A$9*T45)","v":27.119249523153059},{"$f":"(LN('Option vs Time'!$A$6/'Option vs Time'!$A$9)+('Option vs Time'!$A$3+0.5*'Option vs Time'!$A$15^2)*O45)/('Option vs Time'!$A$15*SQRT(O45))","v":0.54746236596775755},{"$f":"Q45-'Option vs Time'!$A$15*SQRT(O45)","v":1.8312065958393409E-2},0.70796944055180111,0.50730504908086083,2.7502805314486691]
[null,null,null,8.0000009999999993,{"$f":"IF($C$4, 'Other Graphs'!$A$6*H46-EXP(-1*'Other Graphs'!$A$3*D46)*'Other Graphs'!$A$9*I46,-1*'Other Graphs'!$A$6*H46+EXP(-1*'Other Graphs'!$A$3*D46)*'Other Graphs'!$A$9*I46)","v":37.431407902722313},{"$f":"(LN('Other Graphs'!$A$6/'Other Graphs'!$A$9)+('Other Graphs'!$A$3+0.5*'Other Graphs'!$A$15^2)*D46)/('Other Graphs'!$A$15*SQRT(D46))","v":0.77781750791879212},{"$f":"F46-'Other Graphs'!$A$15*SQRT(D46)","v":0.21213204761421622},0.78166169749412129,0.58399799088527915,{"$f":"(F46*SQRT(D46)+SQRT(F46^2*D46-2*D46*LN('Other Graphs'!$A$6/'Other Graphs'!$A$9)-2*Data!D46^2*'Other Graphs'!$A$3))/D46","v":0.35000000000000031},{"$f":"(F46*SQRT(D46)-SQRT(F46^2*D46-2*D46*LN('Other Graphs'!$A$6/'Other Graphs'!$A$9)-2*Data!D46^2*'Other Graphs'!$A$3))/D46","v":0.19999999999999982},null,null,null,8.0000009999999993,{"$f":"IF($C$4, 'Option vs Time'!$A$6*S46-EXP(-1*'Option vs Time'!$A$3*O46)*'Option vs Time'!$A$9*T46,-1*'Option vs Time'!$A$6*S46+EXP(-1*'Option vs Time'!$A$3*O46)*'Option vs Time'!$A$9*T46)","v":29.869530054601725},{"$f":"(LN('Option vs Time'!$A$6/'Option vs Time'!$A$9)+('Option vs Time'!$A$3+0.5*'Option vs Time'!$A$15^2)*O46)/('Option vs Time'!$A$15*SQRT(O46))","v":0.60933133230980951},{"$f":"Q46-'Option vs Time'!$A$15*SQRT(O46)","v":4.3645872005233621E-2},0.72884757850428072,0.51740665702872191,2.6093603357923243]
[null,null,null,9.0000009999999993,{"$f":"IF($C$4, 'Other Graphs'!$A$6*H47-EXP(-1*'Other Graphs'!$A$3*D47)*'Other Graphs'!$A$9*I47,-1*'Other Graphs'!$A$6*H47+EXP(-1*'Other Graphs'!$A$3*D47)*'Other Graphs'!$A$9*I47)","v":40.200712145995354},{"$f":"(LN('Other Graphs'!$A$6/'Other Graphs'!$A$9)+('Other Graphs'!$A$3+0.5*'Other Graphs'!$A$15^2)*D47)/('Other Graphs'!$A$15*SQRT(D47))","v":0.8250000458333322},{"$f":"F47-'Other Graphs'!$A$15*SQRT(D47)","v":0.22500001249999979},0.79531421766329724,0.58901036773086446,{"$f":"(F47*SQRT(D47)+SQRT(F47^2*D47-2*D47*LN('Other Graphs'!$A$6/'Other Graphs'!$A$9)-2*Data!D47^2*'Other Graphs'!$A$3))/D47","v":0.3500000000000002},{"$f":"(F47*SQRT(D47)-SQRT(F47^2*D47-2*D47*LN('Other Graphs'!$A$6/'Other Graphs'!$A$9)-2*Data!D47^2*'Other Graphs'!$A$3))/D47","v":0.1999999999999999},null,null,null,9.0000009999999993,{"$f":"IF($C$4, 'Option vs Time'!$A$6*S47-EXP(-1*'Option vs Time'!$A$3*O47)*'Option vs Time'!$A$9*T47,-1*'Option vs Time'!$A$6*S47+EXP(-1*'Option vs Time'!$A$3*O47)*'Option vs Time'!$A$9*T47)","v":32.478890390394049},{"$f":"(LN('Option vs Time'!$A$6/'Option vs Time'!$A$9)+('Option vs Time'!$A$3+0.5*'Option vs Time'!$A$15^2)*O47)/('Option vs Time'!$A$15*SQRT(O47))","v":0.66614975498447326},{"$f":"Q47-'Option vs Time'!$A$15*SQRT(O47)","v":6.6149721651140858E-2},0.7473423075993334,0.52637068732313985,2.4832324518653834]
[null,null,null,10.000000999999999,{"$f":"IF($C$4, 'Other Graphs'!$A$6*H48-EXP(-1*'Other Graphs'!$A$3*D48)*'Other Graphs'!$A$9*I48,-1*'Other Graphs'!$A$6*H48+EXP(-1*'Other Graphs'!$A$3*D48)*'Other Graphs'!$A$9*I48)","v":42.828247712324576},{"$f":"(LN('Other Graphs'!$A$6/'Other Graphs'!$A$9)+('Other Graphs'!$A$3+0.5*'Other Graphs'!$A$15^2)*D48)/('Other Graphs'!$A$15*SQRT(D48))","v":0.86962640002762104},{"$f":"F48-'Other Graphs'!$A$15*SQRT(D48)","v":0.23717083637116931},0.8077476971947547,0.59373786994198685,{"$f":"(F48*SQRT(D48)+SQRT(F48^2*D48-2*D48*LN('Other Graphs'!$A$6/'Other Graphs'!$A$9)-2*Data!D48^2*'Other Graphs'!$A$3))/D48","v":0.35000000000000003},{"$f":"(F48*SQRT(D48)-SQRT(F48^2*D48-2*D48*LN('Other Graphs'!$A$6/'Other Graphs'!$A$9)-2*Data!D48^2*'Other Graphs'!$A$3))/D48","v":0.20000000000000004},null,null,null,10.000000999999999,{"$f":"IF($C$4, 'Option vs Time'!$A$6*S48-EXP(-1*'Option vs Time'!$A$3*O48)*'Option vs Time'!$A$9*T48,-1*'Option vs Time'!$A$6*S48+EXP(-1*'Option vs Time'!$A$3*O48)*'Option vs Time'!$A$9*T48)","v":34.962122842259433},{"$f":"(LN('Option vs Time'!$A$6/'Option vs Time'!$A$9)+('Option vs Time'!$A$3+0.5*'Option vs Time'!$A$15^2)*O48)/('Option vs Time'!$A$15*SQRT(O48))","v":0.71892778137162783},{"$f":"Q48-'Option vs Time'!$A$15*SQRT(O48)","v":8.6472217715176103E-2},0.76390729098305377,0.53445447980956451,2.3687696111236534]
[null,null,null,11.000000999999999,{"$f":"IF($C$4, 'Other Graphs'!$A$6*H49-EXP(-1*'Other Graphs'!$A$3*D49)*'Other Graphs'!$A$9*I49,-1*'Other Graphs'!$A$6*H49+EXP(-1*'Other Graphs'!$A$3*D49)*'Other Graphs'!$A$9*I49)","v":45.328165201130304},{"$f":"(LN('Other Graphs'!$A$6/'Other Graphs'!$A$9)+('Other Graphs'!$A$3+0.5*'Other Graphs'!$A$15^2)*D49)/('Other Graphs'!$A$15*SQRT(D49))","v":0.91207185880554398},{"$f":"F49-'Other Graphs'!$A$15*SQRT(D49)","v":0.24874687058333023},0.81913455441569838,0.59822170471045999,{"$f":"(F49*SQRT(D49)+SQRT(F49^2*D49-2*D49*LN('Other Graphs'!$A$6/'Other Graphs'!$A$9)-2*Data!D49^2*'Other Graphs'!$A$3))/D49","v":0.35000000000000009},{"$f":"(F49*SQRT(D49)-SQRT(F49^2*D49-2*D49*LN('Other Graphs'!$A$6/'Other Graphs'!$A$9)-2*Data!D49^2*'Other Graphs'!$A$3))/D49","v":0.19999999999999996},null,null,null,11.000000999999999,{"$f":"IF($C$4, 'Option vs Time'!$A$6*S49-EXP(-1*'Option vs Time'!$A$3*O49)*'Option vs Time'!$A$9*T49,-1*'Option vs Time'!$A$6*S49+EXP(-1*'Option vs Time'!$A$3*O49)*'Option vs Time'!$A$9*T49)","v":37.330892453383086},{"$f":"(LN('Option vs Time'!$A$6/'Option vs Time'!$A$9)+('Option vs Time'!$A$3+0.5*'Option vs Time'!$A$15^2)*O49)/('Option vs Time'!$A$15*SQRT(O49))","v":0.76838636301295071},{"$f":"Q49-'Option vs Time'!$A$15*SQRT(O49)","v":0.10506137479073696},0.7788711601471906,0.54183644595798541,2.2637829152970852]
[null,null,null,12.000000999999999,{"$f":"IF($C$4, 'Other Graphs'!$A$6*H50-EXP(-1*'Other Graphs'!$A$3*D50)*'Other Graphs'!$A$9*I50,-1*'Other Graphs'!$A$6*H50+EXP(-1*'Other Graphs'!$A$3*D50)*'Other Graphs'!$A$9*I50)","v":47.711840464884553},{"$f":"(LN('Other Graphs'!$A$6/'Other Graphs'!$A$9)+('Other Graphs'!$A$3+0.5*'Other Graphs'!$A$15^2)*D50)/('Other Graphs'!$A$15*SQRT(D50))","v":0.95262798385571257},{"$f":"F50-'Other Graphs'!$A$15*SQRT(D50)","v":0.25980763196064871},0.82961070327766617,0.6024939181932345,{"$f":"(F50*SQRT(D50)+SQRT(F50^2*D50-2*D50*LN('Other Graphs'!$A$6/'Other Graphs'!$A$9)-2*Data!D50^2*'Other Graphs'!$A$3))/D50","v":0.34999999999999987},{"$f":"(F50*SQRT(D50)-SQRT(F50^2*D50-2*D50*LN('Other Graphs'!$A$6/'Other Graphs'!$A$9)-2*Data!D50^2*'Other Graphs'!$A$3))/D50","v":0.20000000000000009},null,null,null,12.000000999999999,{"$f":"IF($C$4, 'Option vs Time'!$A$6*S50-EXP(-1*'Option vs Time'!$A$3*O50)*'Option vs Time'!$A$9*T50,-1*'Option vs Time'!$A$6*S50+EXP(-1*'Option vs Time'!$A$3*O50)*'Option vs Time'!$A$9*T50)","v":39.594675368680171},{"$f":"(LN('Option vs Time'!$A$6/'Option vs Time'!$A$9)+('Option vs Time'!$A$3+0.5*'Option vs Time'!$A$15^2)*O50)/('Option vs Time'!$A$15*SQRT(O50))","v":0.81505959467138223},{"$f":"Q50-'Option vs Time'!$A$15*SQRT(O50)","v":0.12223924277631837},0.79248090076753885,0.54864522588158882,2.1666836885340288]
[null,null,null,13.000000999999999,{"$f":"IF($C$4, 'Other Graphs'!$A$6*H51-EXP(-1*'Other Graphs'!$A$3*D51)*'Other Graphs'!$A$9*I51,-1*'Other Graphs'!$A$6*H51+EXP(-1*'Other Graphs'!$A$3*D51)*'Other Graphs'!$A$9*I51)","v":49.988653683946062},{"$f":"(LN('Other Graphs'!$A$6/'Other Graphs'!$A$9)+('Other Graphs'!$A$3+0.5*'Other Graphs'!$A$15^2)*D51)/('Other Graphs'!$A$15*SQRT(D51))","v":0.99152663888823478},{"$f":"F51-'Other Graphs'!$A$15*SQRT(D51)","v":0.27041635606042758},0.83928575435662345,0.6065800208219071,{"$f":"(F51*SQRT(D51)+SQRT(F51^2*D51-2*D51*LN('Other Graphs'!$A$6/'Other Graphs'!$A$9)-2*Data!D51^2*'Other Graphs'!$A$3))/D51","v":0.34999999999999992},{"$f":"(F51*SQRT(D51)-SQRT(F51^2*D51-2*D51*LN('Other Graphs'!$A$6/'Other Graphs'!$A$9)-2*Data!D51^2*'Other Graphs'!$A$3))/D51","v":0.20000000000000009},null,null,null,13.000000999999999,{"$f":"IF($C$4, 'Option vs Time'!$A$6*S51-EXP(-1*'Option vs Time'!$A$3*O51)*'Option vs Time'!$A$9*T51,-1*'Option vs Time'!$A$6*S51+EXP(-1*'Option vs Time'!$A$3*O51)*'Option vs Time'!$A$9*T51)","v":41.7613590572142},{"$f":"(LN('Option vs Time'!$A$6/'Option vs Time'!$A$9)+('Option vs Time'!$A$3+0.5*'Option vs Time'!$A$15^2)*O51)/('Option vs Time'!$A$15*SQRT(O51))","v":0.85935520537244925},{"$f":"Q51-'Option vs Time'!$A$15*SQRT(O51)","v":0.13824492254464205},0.80492771231222127,0.55497657356954322,2.0762834183260921]
[null,null,null,14.000000999999999,{"$f":"IF($C$4, 'Other Graphs'!$A$6*H52-EXP(-1*'Other Graphs'!$A$3*D52)*'Other Graphs'!$A$9*I52,-1*'Other Graphs'!$A$6*H52+EXP(-1*'Other Graphs'!$A$3*D52)*'Other Graphs'!$A$9*I52)","v":52.166503564546311},{"$f":"(LN('Other Graphs'!$A$6/'Other Graphs'!$A$9)+('Other Graphs'!$A$3+0.5*'Other Graphs'!$A$15^2)*D52)/('Other Graphs'!$A$15*SQRT(D52))","v":1.0289558181112539},{"$f":"F52-'Other Graphs'!$A$15*SQRT(D52)","v":0.28062431403034194},0.84824978155292008,0.61050071739933576,{"$f":"(F52*SQRT(D52)+SQRT(F52^2*D52-2*D52*LN('Other Graphs'!$A$6/'Other Graphs'!$A$9)-2*Data!D52^2*'Other Graphs'!$A$3))/D52","v":0.35},{"$f":"(F52*SQRT(D52)-SQRT(F52^2*D52-2*D52*LN('Other Graphs'!$A$6/'Other Graphs'!$A$9)-2*Data!D52^2*'Other Graphs'!$A$3))/D52","v":0.20000000000000007},null,null,null,14.000000999999999,{"$f":"IF($C$4, 'Option vs Time'!$A$6*S52-EXP(-1*'Option vs Time'!$A$3*O52)*'Option vs Time'!$A$9*T52,-1*'Option vs Time'!$A$6*S52+EXP(-1*'Option vs Time'!$A$3*O52)*'Option vs Time'!$A$9*T52)","v":43.837642475540292},{"$f":"(LN('Option vs Time'!$A$6/'Option vs Time'!$A$9)+('Option vs Time'!$A$3+0.5*'Option vs Time'!$A$15^2)*O52)/('Option vs Time'!$A$15*SQRT(O52))","v":0.90159223755295159},{"$f":"Q52-'Option vs Time'!$A$15*SQRT(O52)","v":0.15326073347203961},0.81636324198340093,0.5609036675321466,1.9916697285886826]
[null,null,null,15.000000999999999,{"$f":"IF($C$4, 'Other Graphs'!$A$6*H53-EXP(-1*'Other Graphs'!$A$3*D53)*'Other Graphs'!$A$9*I53,-1*'Other Graphs'!$A$6*H53+EXP(-1*'Other Graphs'!$A$3*D53)*'Other Graphs'!$A$9*I53)","v":54.252159260462768},{"$f":"(LN('Other Graphs'!$A$6/'Other Graphs'!$A$9)+('Other Graphs'!$A$3+0.5*'Other Graphs'!$A$15^2)*D53)/('Other Graphs'!$A$15*SQRT(D53))","v":1.0650704557093864},{"$f":"F53-'Other Graphs'!$A$15*SQRT(D53)","v":0.29047376064801445},0.85657797614426934,0.61427308909455602,{"$f":"(F53*SQRT(D53)+SQRT(F53^2*D53-2*D53*LN('Other Graphs'!$A$6/'Other Graphs'!$A$9)-2*Data!D53^2*'Other Graphs'!$A$3))/D53","v":0.35},{"$f":"(F53*SQRT(D53)-SQRT(F53^2*D53-2*D53*LN('Other Graphs'!$A$6/'Other Graphs'!$A$9)-2*Data!D53^2*'Other Graphs'!$A$3))/D53","v":0.20000000000000009},null,null,null,15.000000999999999,{"$f":"IF($C$4, 'Option vs Time'!$A$6*S53-EXP(-1*'Option vs Time'!$A$3*O53)*'Option vs Time'!$A$9*T53,-1*'Option vs Time'!$A$6*S53+EXP(-1*'Option vs Time'!$A$3*O53)*'Option vs Time'!$A$9*T53)","v":45.829312204128975},{"$f":"(LN('Option vs Time'!$A$6/'Option vs Time'!$A$9)+('Option vs Time'!$A$3+0.5*'Option vs Time'!$A$15^2)*O53)/('Option vs Time'!$A$15*SQRT(O53))","v":0.94202554677548844},{"$f":"Q53-'Option vs Time'!$A$15*SQRT(O53)","v":0.16742885171411648},0.82691021966132228,0.56648368740474975,1.9121264332565711]
[null,null,null,16.000001000000001,{"$f":"IF($C$4, 'Other Graphs'!$A$6*H54-EXP(-1*'Other Graphs'!$A$3*D54)*'Other Graphs'!$A$9*I54,-1*'Other Graphs'!$A$6*H54+EXP(-1*'Other Graphs'!$A$3*D54)*'Other Graphs'!$A$9*I54)","v":56.251508702769726},{"$f":"(LN('Other Graphs'!$A$6/'Other Graphs'!$A$9)+('Other Graphs'!$A$3+0.5*'Other Graphs'!$A$15^2)*D54)/('Other Graphs'!$A$15*SQRT(D54))","v":1.1000000343749996},{"$f":"F54-'Other Graphs'!$A$15*SQRT(D54)","v":0.30000000937499993},0.86433394654228568,0.61791142576446334,{"$f":"(F54*SQRT(D54)+SQRT(F54^2*D54-2*D54*LN('Other Graphs'!$A$6/'Other Graphs'!$A$9)-2*Data!D54^2*'Other Graphs'!$A$3))/D54","v":0.34999999999999987},{"$f":"(F54*SQRT(D54)-SQRT(F54^2*D54-2*D54*LN('Other Graphs'!$A$6/'Other Graphs'!$A$9)-2*Data!D54^2*'Other Graphs'!$A$3))/D54","v":0.20000000000000009},null,null,null,16.000001000000001,{"$f":"IF($C$4, 'Option vs Time'!$A$6*S54-EXP(-1*'Option vs Time'!$A$3*O54)*'Option vs Time'!$A$9*T54,-1*'Option vs Time'!$A$6*S54+EXP(-1*'Option vs Time'!$A$3*O54)*'Option vs Time'!$A$9*T54)","v":47.741438637385549},{"$f":"(LN('Option vs Time'!$A$6/'Option vs Time'!$A$9)+('Option vs Time'!$A$3+0.5*'Option vs Time'!$A$15^2)*O54)/('Option vs Time'!$A$15*SQRT(O54))","v":0.98086231334264729},{"$f":"Q54-'Option vs Time'!$A$15*SQRT(O54)","v":0.18086228834264761},0.83666967786148794,0.57176216491463727,1.8370802740093879]
[null,null,null,17.000001000000001,{"$f":"IF($C$4, 'Other Graphs'!$A$6*H55-EXP(-1*'Other Graphs'!$A$3*D55)*'Other Graphs'!$A$9*I55,-1*'Other Graphs'!$A$6*H55+EXP(-1*'Other Graphs'!$A$3*D55)*'Other Graphs'!$A$9*I55)","v":58.169738468130411},{"$f":"(LN('Other Graphs'!$A$6/'Other Graphs'!$A$9)+('Other Graphs'!$A$3+0.5*'Other Graphs'!$A$15^2)*D55)/('Other Graphs'!$A$15*SQRT(D55))","v":1.1338540803935047},{"$f":"F55-'Other Graphs'!$A$15*SQRT(D55)","v":0.30923293101641036},0.87157211920157895,0.62142782732730528,{"$f":"(F55*SQRT(D55)+SQRT(F55^2*D55-2*D55*LN('Other Graphs'!$A$6/'Other Graphs'!$A$9)-2*Data!D55^2*'Other Graphs'!$A$3))/D55","v":0.34999999999999992},{"$f":"(F55*SQRT(D55)-SQRT(F55^2*D55-2*D55*LN('Other Graphs'!$A$6/'Other Graphs'!$A$9)-2*Data!D55^2*'Other Graphs'!$A$3))/D55","v":0.20000000000000009},null,null,null,17.000001000000001,{"$f":"IF($C$4, 'Option vs Time'!$A$6*S55-EXP(-1*'Option vs Time'!$A$3*O55)*'Option vs Time'!$A$9*T55,-1*'Option vs Time'!$A$6*S55+EXP(-1*'Option vs Time'!$A$3*O55)*'Option vs Time'!$A$9*T55)","v":49.578518911394937},{"$f":"(LN('Option vs Time'!$A$6/'Option vs Time'!$A$9)+('Option vs Time'!$A$3+0.5*'Option vs Time'!$A$15^2)*O55)/('Option vs Time'!$A$15*SQRT(O55))","v":1.0182735136370971},{"$f":"Q55-'Option vs Time'!$A$15*SQRT(O55)","v":0.19365236426000276},0.84572600405338594,0.57677595326877062,1.7660644152745917]
[null,null,null,18.000001000000001,{"$f":"IF($C$4, 'Other Graphs'!$A$6*H56-EXP(-1*'Other Graphs'!$A$3*D56)*'Other Graphs'!$A$9*I56,-1*'Other Graphs'!$A$6*H56+EXP(-1*'Other Graphs'!$A$3*D56)*'Other Graphs'!$A$9*I56)","v":60.011467041991821},{"$f":"(LN('Other Graphs'!$A$6/'Other Graphs'!$A$9)+('Other Graphs'!$A$3+0.5*'Other Graphs'!$A$15^2)*D56)/('Other Graphs'!$A$15*SQRT(D56))","v":1.1667262213668639},{"$f":"F56-'Other Graphs'!$A$15*SQRT(D56)","v":0.31819806037278109},0.8783395249788557,0.62483264801712057,{"$f":"(F56*SQRT(D56)+SQRT(F56^2*D56-2*D56*LN('Other Graphs'!$A$6/'Other Graphs'!$A$9)-2*Data!D56^2*'Other Graphs'!$A$3))/D56","v":0.35000000000000003},{"$f":"(F56*SQRT(D56)-SQRT(F56^2*D56-2*D56*LN('Other Graphs'!$A$6/'Other Graphs'!$A$9)-2*Data!D56^2*'Other Graphs'!$A$3))/D56","v":0.2},null,null,null,18.000001000000001,{"$f":"IF($C$4, 'Option vs Time'!$A$6*S56-EXP(-1*'Option vs Time'!$A$3*O56)*'Option vs Time'!$A$9*T56,-1*'Option vs Time'!$A$6*S56+EXP(-1*'Option vs Time'!$A$3*O56)*'Option vs Time'!$A$9*T56)","v":51.344583326669529},{"$f":"(LN('Option vs Time'!$A$6/'Option vs Time'!$A$9)+('Option vs Time'!$A$3+0.5*'Option vs Time'!$A$15^2)*O56)/('Option vs Time'!$A$15*SQRT(O56))","v":1.0544021003940662},{"$f":"Q56-'Option vs Time'!$A$15*SQRT(O56)","v":0.20587393939998344},0.85415056947502233,0.58155530863645577,1.6986928005474269]
[null,null,null,19.000001000000001,{"$f":"IF($C$4, 'Other Graphs'!$A$6*H57-EXP(-1*'Other Graphs'!$A$3*D57)*'Other Graphs'!$A$9*I57,-1*'Other Graphs'!$A$6*H57+EXP(-1*'Other Graphs'!$A$3*D57)*'Other Graphs'!$A$9*I57)","v":61.780845531286083},{"$f":"(LN('Other Graphs'!$A$6/'Other Graphs'!$A$9)+('Other Graphs'!$A$3+0.5*'Other Graphs'!$A$15^2)*D57)/('Other Graphs'!$A$15*SQRT(D57))","v":1.1986972410183483},{"$f":"F57-'Other Graphs'!$A$15*SQRT(D57)","v":0.32691742936864032},0.88467715437828331,0.62813483097325196,{"$f":"(F57*SQRT(D57)+SQRT(F57^2*D57-2*D57*LN('Other Graphs'!$A$6/'Other Graphs'!$A$9)-2*Data!D57^2*'Other Graphs'!$A$3))/D57","v":0.35000000000000009},{"$f":"(F57*SQRT(D57)-SQRT(F57^2*D57-2*D57*LN('Other Graphs'!$A$6/'Other Graphs'!$A$9)-2*Data!D57^2*'Other Graphs'!$A$3))/D57","v":0.2},null,null,null,19.000001000000001,{"$f":"IF($C$4, 'Option vs Time'!$A$6*S57-EXP(-1*'Option vs Time'!$A$3*O57)*'Option vs Time'!$A$9*T57,-1*'Option vs Time'!$A$6*S57+EXP(-1*'Option vs Time'!$A$3*O57)*'Option vs Time'!$A$9*T57)","v":53.043276127216956},{"$f":"(LN('Option vs Time'!$A$6/'Option vs Time'!$A$9)+('Option vs Time'!$A$3+0.5*'Option vs Time'!$A$15^2)*O57)/('Option vs Time'!$A$15*SQRT(O57))","v":1.089368969669686},{"$f":"Q57-'Option vs Time'!$A$15*SQRT(O57)","v":0.21758915801997802},0.86200439525366601,0.58612538362455635,1.6346417449468191]
[null,null,null,20.000001000000001,{"$f":"IF($C$4, 'Other Graphs'!$A$6*H58-EXP(-1*'Other Graphs'!$A$3*D58)*'Other Graphs'!$A$9*I58,-1*'Other Graphs'!$A$6*H58+EXP(-1*'Other Graphs'!$A$3*D58)*'Other Graphs'!$A$9*I58)","v":63.481635127109989},{"$f":"(LN('Other Graphs'!$A$6/'Other Graphs'!$A$9)+('Other Graphs'!$A$3+0.5*'Other Graphs'!$A$15^2)*D58)/('Other Graphs'!$A$15*SQRT(D58))","v":1.2298374183708187},{"$f":"F58-'Other Graphs'!$A$15*SQRT(D58)","v":0.33541020501022323},0.89062100349118312,0.63134216455404868,{"$f":"(F58*SQRT(D58)+SQRT(F58^2*D58-2*D58*LN('Other Graphs'!$A$6/'Other Graphs'!$A$9)-2*Data!D58^2*'Other Graphs'!$A$3))/D58","v":0.35000000000000003},{"$f":"(F58*SQRT(D58)-SQRT(F58^2*D58-2*D58*LN('Other Graphs'!$A$6/'Other Graphs'!$A$9)-2*Data!D58^2*'Other Graphs'!$A$3))/D58","v":0.2},null,null,null,20.000001000000001,{"$f":"IF($C$4, 'Option vs Time'!$A$6*S58-EXP(-1*'Option vs Time'!$A$3*O58)*'Option vs Time'!$A$9*T58,-1*'Option vs Time'!$A$6*S58+EXP(-1*'Option vs Time'!$A$3*O58)*'Option vs Time'!$A$9*T58)","v":54.677917872163775},{"$f":"(LN('Option vs Time'!$A$6/'Option vs Time'!$A$9)+('Option vs Time'!$A$3+0.5*'Option vs Time'!$A$15^2)*O58)/('Option vs Time'!$A$15*SQRT(O58))","v":1.1232774005397199},{"$f":"Q58-'Option vs Time'!$A$15*SQRT(O58)","v":0.22885018717912442},0.86934015056927594,0.59050732101547365,1.5736364668370584]
[null,null,null,21.000001000000001,{"$f":"IF($C$4, 'Other Graphs'!$A$6*H59-EXP(-1*'Other Graphs'!$A$3*D59)*'Other Graphs'!$A$9*I59,-1*'Other Graphs'!$A$6*H59+EXP(-1*'Other Graphs'!$A$3*D59)*'Other Graphs'!$A$9*I59)","v":65.117267628344848},{"$f":"(LN('Other Graphs'!$A$6/'Other Graphs'!$A$9)+('Other Graphs'!$A$3+0.5*'Other Graphs'!$A$15^2)*D59)/('Other Graphs'!$A$15*SQRT(D59))","v":1.2602083461178157},{"$f":"F59-'Other Graphs'!$A$15*SQRT(D59)","v":0.34369318530485893},0.89620289357785432,0.63446148166599603,{"$f":"(F59*SQRT(D59)+SQRT(F59^2*D59-2*D59*LN('Other Graphs'!$A$6/'Other Graphs'!$A$9)-2*Data!D59^2*'Other Graphs'!$A$3))/D59","v":0.3500000000000002},{"$f":"(F59*SQRT(D59)-SQRT(F59^2*D59-2*D59*LN('Other Graphs'!$A$6/'Other Graphs'!$A$9)-2*Data!D59^2*'Other Graphs'!$A$3))/D59","v":0.19999999999999984},null,null,null,21.000001000000001,{"$f":"IF($C$4, 'Option vs Time'!$A$6*S59-EXP(-1*'Option vs Time'!$A$3*O59)*'Option vs Time'!$A$9*T59,-1*'Option vs Time'!$A$6*S59+EXP(-1*'Option vs Time'!$A$3*O59)*'Option vs Time'!$A$9*T59)","v":56.251554339000833},{"$f":"(LN('Option vs Time'!$A$6/'Option vs Time'!$A$9)+('Option vs Time'!$A$3+0.5*'Option vs Time'!$A$15^2)*O59)/('Option vs Time'!$A$15*SQRT(O59))","v":1.1562164168192495},{"$f":"Q59-'Option vs Time'!$A$15*SQRT(O59)","v":0.23970125600629266},0.87620367678466748,0.59471906941250974,1.5154410635962563]
[null,null,null,22.000001000000001,{"$f":"IF($C$4, 'Other Graphs'!$A$6*H60-EXP(-1*'Other Graphs'!$A$3*D60)*'Other Graphs'!$A$9*I60,-1*'Other Graphs'!$A$6*H60+EXP(-1*'Other Graphs'!$A$3*D60)*'Other Graphs'!$A$9*I60)","v":66.690893404694279},{"$f":"(LN('Other Graphs'!$A$6/'Other Graphs'!$A$9)+('Other Graphs'!$A$3+0.5*'Other Graphs'!$A$15^2)*D60)/('Other Graphs'!$A$15*SQRT(D60))","v":1.2898643632665414},{"$f":"F60-'Other Graphs'!$A$15*SQRT(D60)","v":0.35178118998178398},0.90145112204848632,0.63749881687454701,{"$f":"(F60*SQRT(D60)+SQRT(F60^2*D60-2*D60*LN('Other Graphs'!$A$6/'Other Graphs'!$A$9)-2*Data!D60^2*'Other Graphs'!$A$3))/D60","v":0.3500000000000002},{"$f":"(F60*SQRT(D60)-SQRT(F60^2*D60-2*D60*LN('Other Graphs'!$A$6/'Other Graphs'!$A$9)-2*Data!D60^2*'Other Graphs'!$A$3))/D60","v":0.1999999999999999},null,null,null,22.000001000000001,{"$f":"IF($C$4, 'Option vs Time'!$A$6*S60-EXP(-1*'Option vs Time'!$A$3*O60)*'Option vs Time'!$A$9*T60,-1*'Option vs Time'!$A$6*S60+EXP(-1*'Option vs Time'!$A$3*O60)*'Option vs Time'!$A$9*T60)","v":57.76699540259709},{"$f":"(LN('Option vs Time'!$A$6/'Option vs Time'!$A$9)+('Option vs Time'!$A$3+0.5*'Option vs Time'!$A$15^2)*O60)/('Option vs Time'!$A$15*SQRT(O60))","v":1.1882633725243343},{"$f":"Q60-'Option vs Time'!$A$15*SQRT(O60)","v":0.25018019923957691},0.88263516836244849,0.59877600141371223,1.4598509354433986]
[null,null,null,23.000001000000001,{"$f":"IF($C$4, 'Other Graphs'!$A$6*H61-EXP(-1*'Other Graphs'!$A$3*D61)*'Other Graphs'!$A$9*I61,-1*'Other Graphs'!$A$6*H61+EXP(-1*'Other Graphs'!$A$3*D61)*'Other Graphs'!$A$9*I61)","v":68.205419897499354},{"$f":"(LN('Other Graphs'!$A$6/'Other Graphs'!$A$9)+('Other Graphs'!$A$3+0.5*'Other Graphs'!$A$15^2)*D61)/('Other Graphs'!$A$15*SQRT(D61))","v":1.3188536975817295},{"$f":"F61-'Other Graphs'!$A$15*SQRT(D61)","v":0.35968737206774437},0.90639098586529054,0.6404595317422126,{"$f":"(F61*SQRT(D61)+SQRT(F61^2*D61-2*D61*LN('Other Graphs'!$A$6/'Other Graphs'!$A$9)-2*Data!D61^2*'Other Graphs'!$A$3))/D61","v":0.35000000000000003},{"$f":"(F61*SQRT(D61)-SQRT(F61^2*D61-2*D61*LN('Other Graphs'!$A$6/'Other Graphs'!$A$9)-2*Data!D61^2*'Other Graphs'!$A$3))/D61","v":0.2},null,null,null,23.000001000000001,{"$f":"IF($C$4, 'Option vs Time'!$A$6*S61-EXP(-1*'Option vs Time'!$A$3*O61)*'Option vs Time'!$A$9*T61,-1*'Option vs Time'!$A$6*S61+EXP(-1*'Option vs Time'!$A$3*O61)*'Option vs Time'!$A$9*T61)","v":59.226846338040488},{"$f":"(LN('Option vs Time'!$A$6/'Option vs Time'!$A$9)+('Option vs Time'!$A$3+0.5*'Option vs Time'!$A$15^2)*O61)/('Option vs Time'!$A$15*SQRT(O61))","v":1.2194859682640313},{"$f":"Q61-'Option vs Time'!$A$15*SQRT(O61)","v":0.26031964275004615},0.88867010080101183,0.60269138896981911,1.4066869794541361]
[null,null,null,24.000001000000001,{"$f":"IF($C$4, 'Other Graphs'!$A$6*H62-EXP(-1*'Other Graphs'!$A$3*D62)*'Other Graphs'!$A$9*I62,-1*'Other Graphs'!$A$6*H62+EXP(-1*'Other Graphs'!$A$3*D62)*'Other Graphs'!$A$9*I62)","v":69.663542890017538},{"$f":"(LN('Other Graphs'!$A$6/'Other Graphs'!$A$9)+('Other Graphs'!$A$3+0.5*'Other Graphs'!$A$15^2)*D62)/('Other Graphs'!$A$15*SQRT(D62))","v":1.3472193865978179},{"$f":"F62-'Other Graphs'!$A$15*SQRT(D62)","v":0.36742346907213241},0.91104520702491099,0.64334841591521075,{"$f":"(F62*SQRT(D62)+SQRT(F62^2*D62-2*D62*LN('Other Graphs'!$A$6/'Other Graphs'!$A$9)-2*Data!D62^2*'Other Graphs'!$A$3))/D62","v":0.35000000000000026},{"$f":"(F62*SQRT(D62)-SQRT(F62^2*D62-2*D62*LN('Other Graphs'!$A$6/'Other Graphs'!$A$9)-2*Data!D62^2*'Other Graphs'!$A$3))/D62","v":0.19999999999999982},null,null,null,24.000001000000001,{"$f":"IF($C$4, 'Option vs Time'!$A$6*S62-EXP(-1*'Option vs Time'!$A$3*O62)*'Option vs Time'!$A$9*T62,-1*'Option vs Time'!$A$6*S62+EXP(-1*'Option vs Time'!$A$3*O62)*'Option vs Time'!$A$9*T62)","v":60.633533317494624},{"$f":"(LN('Option vs Time'!$A$6/'Option vs Time'!$A$9)+('Option vs Time'!$A$3+0.5*'Option vs Time'!$A$15^2)*O62)/('Option vs Time'!$A$15*SQRT(O62))","v":1.249943843702094},{"$f":"Q62-'Option vs Time'!$A$15*SQRT(O62)","v":0.27014792617640848},0.89433996907669699,0.60647677373821174,1.3557910836112654]
[null,null,null,25.000001000000001,{"$f":"IF($C$4, 'Other Graphs'!$A$6*H63-EXP(-1*'Other Graphs'!$A$3*D63)*'Other Graphs'!$A$9*I63,-1*'Other Graphs'!$A$6*H63+EXP(-1*'Other Graphs'!$A$3*D63)*'Other Graphs'!$A$9*I63)","v":71.067772180487992},{"$f":"(LN('Other Graphs'!$A$6/'Other Graphs'!$A$9)+('Other Graphs'!$A$3+0.5*'Other Graphs'!$A$15^2)*D63)/('Other Graphs'!$A$15*SQRT(D63))","v":1.3750000275000001},{"$f":"F63-'Other Graphs'!$A$15*SQRT(D63)","v":0.37500000750000018},0.91543428191150156,0.64616976946163707,{"$f":"(F63*SQRT(D63)+SQRT(F63^2*D63-2*D63*LN('Other Graphs'!$A$6/'Other Graphs'!$A$9)-2*Data!D63^2*'Other Graphs'!$A$3))/D63","v":0.35000000000000031},{"$f":"(F63*SQRT(D63)-SQRT(F63^2*D63-2*D63*LN('Other Graphs'!$A$6/'Other Graphs'!$A$9)-2*Data!D63^2*'Other Graphs'!$A$3))/D63","v":0.19999999999999987},null,null,null,25.000001000000001,{"$f":"IF($C$4, 'Option vs Time'!$A$6*S63-EXP(-1*'Option vs Time'!$A$3*O63)*'Option vs Time'!$A$9*T63,-1*'Option vs Time'!$A$6*S63+EXP(-1*'Option vs Time'!$A$3*O63)*'Option vs Time'!$A$9*T63)","v":61.98932440110589},{"$f":"(LN('Option vs Time'!$A$6/'Option vs Time'!$A$9)+('Option vs Time'!$A$3+0.5*'Option vs Time'!$A$15^2)*O63)/('Option vs Time'!$A$15*SQRT(O63))","v":1.2796898496018785},{"$f":"Q63-'Option vs Time'!$A$15*SQRT(O63)","v":0.2796898296018786},0.89967288206866725,0.61014225907448205,1.3070225891490495]
[null,null,null,26.000001000000001,{"$f":"IF($C$4, 'Other Graphs'!$A$6*H64-EXP(-1*'Other Graphs'!$A$3*D64)*'Other Graphs'!$A$9*I64,-1*'Other Graphs'!$A$6*H64+EXP(-1*'Other Graphs'!$A$3*D64)*'Other Graphs'!$A$9*I64)","v":72.420452870815751},{"$f":"(LN('Other Graphs'!$A$6/'Other Graphs'!$A$9)+('Other Graphs'!$A$3+0.5*'Other Graphs'!$A$15^2)*D64)/('Other Graphs'!$A$15*SQRT(D64))","v":1.4022303932039841},{"$f":"F64-'Other Graphs'!$A$15*SQRT(D64)","v":0.38242647087381365},0.919576770764445,0.64892747054617295,{"$f":"(F64*SQRT(D64)+SQRT(F64^2*D64-2*D64*LN('Other Graphs'!$A$6/'Other Graphs'!$A$9)-2*Data!D64^2*'Other Graphs'!$A$3))/D64","v":0.34999999999999992},{"$f":"(F64*SQRT(D64)-SQRT(F64^2*D64-2*D64*LN('Other Graphs'!$A$6/'Other Graphs'!$A$9)-2*Data!D64^2*'Other Graphs'!$A$3))/D64","v":0.20000000000000009},null,null,null,26.000001000000001,{"$f":"IF($C$4, 'Option vs Time'!$A$6*S64-EXP(-1*'Option vs Time'!$A$3*O64)*'Option vs Time'!$A$9*T64,-1*'Option vs Time'!$A$6*S64+EXP(-1*'Option vs Time'!$A$3*O64)*'Option vs Time'!$A$9*T64)","v":63.296346990254939},{"$f":"(LN('Option vs Time'!$A$6/'Option vs Time'!$A$9)+('Option vs Time'!$A$3+0.5*'Option vs Time'!$A$15^2)*O64)/('Option vs Time'!$A$15*SQRT(O64))","v":1.3087710744885306},{"$f":"Q64-'Option vs Time'!$A$15*SQRT(O64)","v":0.28896715215836011},0.904694046074487,0.61369674274628006,1.2602554834358202]
[null,null,null,27.000001000000001,{"$f":"IF($C$4, 'Other Graphs'!$A$6*H65-EXP(-1*'Other Graphs'!$A$3*D65)*'Other Graphs'!$A$9*I65,-1*'Other Graphs'!$A$6*H65+EXP(-1*'Other Graphs'!$A$3*D65)*'Other Graphs'!$A$9*I65)","v":73.723783183435458},{"$f":"(LN('Other Graphs'!$A$6/'Other Graphs'!$A$9)+('Other Graphs'!$A$3+0.5*'Other Graphs'!$A$15^2)*D65)/('Other Graphs'!$A$15*SQRT(D65))","v":1.4289419427062111},{"$f":"F65-'Other Graphs'!$A$15*SQRT(D65)","v":0.38971143891987592},0.92348953953165225,0.65162503151403073,{"$f":"(F65*SQRT(D65)+SQRT(F65^2*D65-2*D65*LN('Other Graphs'!$A$6/'Other Graphs'!$A$9)-2*Data!D65^2*'Other Graphs'!$A$3))/D65","v":0.3500000000000002},{"$f":"(F65*SQRT(D65)-SQRT(F65^2*D65-2*D65*LN('Other Graphs'!$A$6/'Other Graphs'!$A$9)-2*Data!D65^2*'Other Graphs'!$A$3))/D65","v":0.1999999999999999},null,null,null,27.000001000000001,{"$f":"IF($C$4, 'Option vs Time'!$A$6*S65-EXP(-1*'Option vs Time'!$A$3*O65)*'Option vs Time'!$A$9*T65,-1*'Option vs Time'!$A$6*S65+EXP(-1*'Option vs Time'!$A$3*O65)*'Option vs Time'!$A$9*T65)","v":64.556602473690759},{"$f":"(LN('Option vs Time'!$A$6/'Option vs Time'!$A$9)+('Option vs Time'!$A$3+0.5*'Option vs Time'!$A$15^2)*O65)/('Option vs Time'!$A$15*SQRT(O65))","v":1.3372296811270219},{"$f":"Q65-'Option vs Time'!$A$15*SQRT(O65)","v":0.29799917734068671},0.90942616187809278,0.61714810424835775,1.2153761505466889]
[null,null,null,28.000001000000001,{"$f":"IF($C$4, 'Other Graphs'!$A$6*H66-EXP(-1*'Other Graphs'!$A$3*D66)*'Other Graphs'!$A$9*I66,-1*'Other Graphs'!$A$6*H66+EXP(-1*'Other Graphs'!$A$3*D66)*'Other Graphs'!$A$9*I66)","v":74.979829501326918},{"$f":"(LN('Other Graphs'!$A$6/'Other Graphs'!$A$9)+('Other Graphs'!$A$3+0.5*'Other Graphs'!$A$15^2)*D66)/('Other Graphs'!$A$15*SQRT(D66))","v":1.4551632470705824},{"$f":"F66-'Other Graphs'!$A$15*SQRT(D66)","v":0.39686270374652266},0.92718796349125576,0.65426564572345314,{"$f":"(F66*SQRT(D66)+SQRT(F66^2*D66-2*D66*LN('Other Graphs'!$A$6/'Other Graphs'!$A$9)-2*Data!D66^2*'Other Graphs'!$A$3))/D66","v":0.3500000000000002},{"$f":"(F66*SQRT(D66)-SQRT(F66^2*D66-2*D66*LN('Other Graphs'!$A$6/'Other Graphs'!$A$9)-2*Data!D66^2*'Other Graphs'!$A$3))/D66","v":0.19999999999999987},null,null,null,28.000001000000001,{"$f":"IF($C$4, 'Option vs Time'!$A$6*S66-EXP(-1*'Option vs Time'!$A$3*O66)*'Option vs Time'!$A$9*T66,-1*'Option vs Time'!$A$6*S66+EXP(-1*'Option vs Time'!$A$3*O66)*'Option vs Time'!$A$9*T66)","v":65.771978624237448},{"$f":"(LN('Option vs Time'!$A$6/'Option vs Time'!$A$9)+('Option vs Time'!$A$3+0.5*'Option vs Time'!$A$15^2)*O66)/('Option vs Time'!$A$15*SQRT(O66))","v":1.3651035939733995},{"$f":"Q66-'Option vs Time'!$A$15*SQRT(O66)","v":0.30680305064933977},0.91388975368894432,0.62050335695204351,1.1722815522171004]
[null,null,null,29.000001000000001,{"$f":"IF($C$4, 'Other Graphs'!$A$6*H67-EXP(-1*'Other Graphs'!$A$3*D67)*'Other Graphs'!$A$9*I67,-1*'Other Graphs'!$A$6*H67+EXP(-1*'Other Graphs'!$A$3*D67)*'Other Graphs'!$A$9*I67)","v":76.19053916635788},{"$f":"(LN('Other Graphs'!$A$6/'Other Graphs'!$A$9)+('Other Graphs'!$A$3+0.5*'Other Graphs'!$A$15^2)*D67)/('Other Graphs'!$A$15*SQRT(D67))","v":1.4809203474950974},{"$f":"F67-'Other Graphs'!$A$15*SQRT(D67)","v":0.40388736749866272},0.93068609989657869,0.6568522269275876,{"$f":"(F67*SQRT(D67)+SQRT(F67^2*D67-2*D67*LN('Other Graphs'!$A$6/'Other Graphs'!$A$9)-2*Data!D67^2*'Other Graphs'!$A$3))/D67","v":0.34999999999999981},{"$f":"(F67*SQRT(D67)-SQRT(F67^2*D67-2*D67*LN('Other Graphs'!$A$6/'Other Graphs'!$A$9)-2*Data!D67^2*'Other Graphs'!$A$3))/D67","v":0.20000000000000018},null,null,null,29.000001000000001,{"$f":"IF($C$4, 'Option vs Time'!$A$6*S67-EXP(-1*'Option vs Time'!$A$3*O67)*'Option vs Time'!$A$9*T67,-1*'Option vs Time'!$A$6*S67+EXP(-1*'Option vs Time'!$A$3*O67)*'Option vs Time'!$A$9*T67)","v":66.944260176454549},{"$f":"(LN('Option vs Time'!$A$6/'Option vs Time'!$A$9)+('Option vs Time'!$A$3+0.5*'Option vs Time'!$A$15^2)*O67)/('Option vs Time'!$A$15*SQRT(O67))","v":1.3924270686684448},{"$f":"Q67-'Option vs Time'!$A$15*SQRT(O67)","v":0.31539408867201013},0.91810344384165044,0.62376877273038622,1.1308777442704638]
[null,null,null,30.000001000000001,{"$f":"IF($C$4, 'Other Graphs'!$A$6*H68-EXP(-1*'Other Graphs'!$A$3*D68)*'Other Graphs'!$A$9*I68,-1*'Other Graphs'!$A$6*H68+EXP(-1*'Other Graphs'!$A$3*D68)*'Other Graphs'!$A$9*I68)","v":77.357751452316691},{"$f":"(LN('Other Graphs'!$A$6/'Other Graphs'!$A$9)+('Other Graphs'!$A$3+0.5*'Other Graphs'!$A$15^2)*D68)/('Other Graphs'!$A$15*SQRT(D68))","v":1.5062370582431572},{"$f":"F68-'Other Graphs'!$A$15*SQRT(D68)","v":0.4107919249754064},0.93399683531187994,0.65938744260623661,{"$f":"(F68*SQRT(D68)+SQRT(F68^2*D68-2*D68*LN('Other Graphs'!$A$6/'Other Graphs'!$A$9)-2*Data!D68^2*'Other Graphs'!$A$3))/D68","v":0.35000000000000003},{"$f":"(F68*SQRT(D68)-SQRT(F68^2*D68-2*D68*LN('Other Graphs'!$A$6/'Other Graphs'!$A$9)-2*Data!D68^2*'Other Graphs'!$A$3))/D68","v":0.20000000000000004},null,null,null,30.000001000000001,{"$f":"IF($C$4, 'Option vs Time'!$A$6*S68-EXP(-1*'Option vs Time'!$A$3*O68)*'Option vs Time'!$A$9*T68,-1*'Option vs Time'!$A$6*S68+EXP(-1*'Option vs Time'!$A$3*O68)*'Option vs Time'!$A$9*T68)","v":68.075137920725012},{"$f":"(LN('Option vs Time'!$A$6/'Option vs Time'!$A$9)+('Option vs Time'!$A$3+0.5*'Option vs Time'!$A$15^2)*O68)/('Option vs Time'!$A$15*SQRT(O68))","v":1.4192311672954185},{"$f":"Q68-'Option vs Time'!$A$15*SQRT(O68)","v":0.3237860340276677},0.92208418390757863,0.62694998483162412,1.0910786569816082]
[null,null,null,31.000001000000001,{"$f":"IF($C$4, 'Other Graphs'!$A$6*H69-EXP(-1*'Other Graphs'!$A$3*D69)*'Other Graphs'!$A$9*I69,-1*'Other Graphs'!$A$6*H69+EXP(-1*'Other Graphs'!$A$3*D69)*'Other Graphs'!$A$9*I69)","v":78.483207039649415},{"$f":"(LN('Other Graphs'!$A$6/'Other Graphs'!$A$9)+('Other Graphs'!$A$3+0.5*'Other Graphs'!$A$15^2)*D69)/('Other Graphs'!$A$15*SQRT(D69))","v":1.5311352244739851},{"$f":"F69-'Other Graphs'!$A$15*SQRT(D69)","v":0.4175823339474507},0.93713201210862562,0.66187374234699714,{"$f":"(F69*SQRT(D69)+SQRT(F69^2*D69-2*D69*LN('Other Graphs'!$A$6/'Other Graphs'!$A$9)-2*Data!D69^2*'Other Graphs'!$A$3))/D69","v":0.35000000000000014},{"$f":"(F69*SQRT(D69)-SQRT(F69^2*D69-2*D69*LN('Other Graphs'!$A$6/'Other Graphs'!$A$9)-2*Data!D69^2*'Other Graphs'!$A$3))/D69","v":0.19999999999999993},null,null,null,31.000001000000001,{"$f":"IF($C$4, 'Option vs Time'!$A$6*S69-EXP(-1*'Option vs Time'!$A$3*O69)*'Option vs Time'!$A$9*T69,-1*'Option vs Time'!$A$6*S69+EXP(-1*'Option vs Time'!$A$3*O69)*'Option vs Time'!$A$9*T69)","v":69.166216577706621},{"$f":"(LN('Option vs Time'!$A$6/'Option vs Time'!$A$9)+('Option vs Time'!$A$3+0.5*'Option vs Time'!$A$15^2)*O69)/('Option vs Time'!$A$15*SQRT(O69))","v":1.445544157704576},{"$f":"Q69-'Option vs Time'!$A$15*SQRT(O69)","v":0.33199126717804162},0.92584745047338002,0.63005207340919955,1.052805084893212]
[null,null,null,32.000000999999997,{"$f":"IF($C$4, 'Other Graphs'!$A$6*H70-EXP(-1*'Other Graphs'!$A$3*D70)*'Other Graphs'!$A$9*I70,-1*'Other Graphs'!$A$6*H70+EXP(-1*'Other Graphs'!$A$3*D70)*'Other Graphs'!$A$9*I70)","v":79.568556251014613},{"$f":"(LN('Other Graphs'!$A$6/'Other Graphs'!$A$9)+('Other Graphs'!$A$3+0.5*'Other Graphs'!$A$15^2)*D70)/('Other Graphs'!$A$15*SQRT(D70))","v":1.5556349429172003},{"$f":"F70-'Other Graphs'!$A$15*SQRT(D70)","v":0.42426407534105492},0.94010253767866236,0.66431338214658164,{"$f":"(F70*SQRT(D70)+SQRT(F70^2*D70-2*D70*LN('Other Graphs'!$A$6/'Other Graphs'!$A$9)-2*Data!D70^2*'Other Graphs'!$A$3))/D70","v":0.35000000000000031},{"$f":"(F70*SQRT(D70)-SQRT(F70^2*D70-2*D70*LN('Other Graphs'!$A$6/'Other Graphs'!$A$9)-2*Data!D70^2*'Other Graphs'!$A$3))/D70","v":0.19999999999999987},null,null,null,32.000000999999997,{"$f":"IF($C$4, 'Option vs Time'!$A$6*S70-EXP(-1*'Option vs Time'!$A$3*O70)*'Option vs Time'!$A$9*T70,-1*'Option vs Time'!$A$6*S70+EXP(-1*'Option vs Time'!$A$3*O70)*'Option vs Time'!$A$9*T70)","v":70.219021662599829},{"$f":"(LN('Option vs Time'!$A$6/'Option vs Time'!$A$9)+('Option vs Time'!$A$3+0.5*'Option vs Time'!$A$15^2)*O70)/('Option vs Time'!$A$15*SQRT(O70))","v":1.4713918511638142},{"$f":"Q70-'Option vs Time'!$A$15*SQRT(O70)","v":0.34002098358766886},0.92940741204672506,0.63307963710838866,1.0159838441940394]
[null,null,null,33.000000999999997,{"$f":"IF($C$4, 'Other Graphs'!$A$6*H71-EXP(-1*'Other Graphs'!$A$3*D71)*'Other Graphs'!$A$9*I71,-1*'Other Graphs'!$A$6*H71+EXP(-1*'Other Graphs'!$A$3*D71)*'Other Graphs'!$A$9*I71)","v":80.615366254659875},{"$f":"(LN('Other Graphs'!$A$6/'Other Graphs'!$A$9)+('Other Graphs'!$A$3+0.5*'Other Graphs'!$A$15^2)*D71)/('Other Graphs'!$A$15*SQRT(D71))","v":1.5797547517336354},{"$f":"F71-'Other Graphs'!$A$15*SQRT(D71)","v":0.43084220501826431},0.94291847921727157,0.66670844532761142,{"$f":"(F71*SQRT(D71)+SQRT(F71^2*D71-2*D71*LN('Other Graphs'!$A$6/'Other Graphs'!$A$9)-2*Data!D71^2*'Other Graphs'!$A$3))/D71","v":0.35000000000000003},{"$f":"(F71*SQRT(D71)-SQRT(F71^2*D71-2*D71*LN('Other Graphs'!$A$6/'Other Graphs'!$A$9)-2*Data!D71^2*'Other Graphs'!$A$3))/D71","v":0.19999999999999996},null,null,null,33.000000999999997,{"$f":"IF($C$4, 'Option vs Time'!$A$6*S71-EXP(-1*'Option vs Time'!$A$3*O71)*'Option vs Time'!$A$9*T71,-1*'Option vs Time'!$A$6*S71+EXP(-1*'Option vs Time'!$A$3*O71)*'Option vs Time'!$A$9*T71)","v":71.235005506793868},{"$f":"(LN('Option vs Time'!$A$6/'Option vs Time'!$A$9)+('Option vs Time'!$A$3+0.5*'Option vs Time'!$A$15^2)*O71)/('Option vs Time'!$A$15*SQRT(O71))","v":1.4967978895452927},{"$f":"Q71-'Option vs Time'!$A$15*SQRT(O71)","v":0.34788534282992156},0.93277707219110362,0.63603685335645588,0.98054706516016665]
[null,null,null,34.000000999999997,{"$f":"IF($C$4, 'Other Graphs'!$A$6*H72-EXP(-1*'Other Graphs'!$A$3*D72)*'Other Graphs'!$A$9*I72,-1*'Other Graphs'!$A$6*H72+EXP(-1*'Other Graphs'!$A$3*D72)*'Other Graphs'!$A$9*I72)","v":81.625127402268973},{"$f":"(LN('Other Graphs'!$A$6/'Other Graphs'!$A$9)+('Other Graphs'!$A$3+0.5*'Other Graphs'!$A$15^2)*D72)/('Other Graphs'!$A$15*SQRT(D72))","v":1.6035117946635131},{"$f":"F72-'Other Graphs'!$A$15*SQRT(D72)","v":0.43732139854459473},0.94558914638240821,0.66906086063026904,{"$f":"(F72*SQRT(D72)+SQRT(F72^2*D72-2*D72*LN('Other Graphs'!$A$6/'Other Graphs'!$A$9)-2*Data!D72^2*'Other Graphs'!$A$3))/D72","v":0.3500000000000002},{"$f":"(F72*SQRT(D72)-SQRT(F72^2*D72-2*D72*LN('Other Graphs'!$A$6/'Other Graphs'!$A$9)-2*Data!D72^2*'Other Graphs'!$A$3))/D72","v":0.1999999999999999},null,null,null,34.000000999999997,{"$f":"IF($C$4, 'Option vs Time'!$A$6*S72-EXP(-1*'Option vs Time'!$A$3*O72)*'Option vs Time'!$A$9*T72,-1*'Option vs Time'!$A$6*S72+EXP(-1*'Option vs Time'!$A$3*O72)*'Option vs Time'!$A$9*T72)","v":72.215552571954035},{"$f":"(LN('Option vs Time'!$A$6/'Option vs Time'!$A$9)+('Option vs Time'!$A$3+0.5*'Option vs Time'!$A$15^2)*O72)/('Option vs Time'!$A$15*SQRT(O72))","v":1.5217839909347934},{"$f":"Q72-'Option vs Time'!$A$15*SQRT(O72)","v":0.35559359481587505},0.9359683929529361,0.63892752943482378,0.94643159423814893]
[null,null,null,35.000000999999997,{"$f":"IF($C$4, 'Other Graphs'!$A$6*H73-EXP(-1*'Other Graphs'!$A$3*D73)*'Other Graphs'!$A$9*I73,-1*'Other Graphs'!$A$6*H73+EXP(-1*'Other Graphs'!$A$3*D73)*'Other Graphs'!$A$9*I73)","v":82.599258836410101},{"$f":"(LN('Other Graphs'!$A$6/'Other Graphs'!$A$9)+('Other Graphs'!$A$3+0.5*'Other Graphs'!$A$15^2)*D73)/('Other Graphs'!$A$15*SQRT(D73))","v":1.6269219635941361},{"$f":"F73-'Other Graphs'!$A$15*SQRT(D73)","v":0.44370599007112776},0.94812316370791616,0.67137241793205793,{"$f":"(F73*SQRT(D73)+SQRT(F73^2*D73-2*D73*LN('Other Graphs'!$A$6/'Other Graphs'!$A$9)-2*Data!D73^2*'Other Graphs'!$A$3))/D73","v":0.35},{"$f":"(F73*SQRT(D73)-SQRT(F73^2*D73-2*D73*LN('Other Graphs'!$A$6/'Other Graphs'!$A$9)-2*Data!D73^2*'Other Graphs'!$A$3))/D73","v":0.20000000000000004},null,null,null,35.000000999999997,{"$f":"IF($C$4, 'Option vs Time'!$A$6*S73-EXP(-1*'Option vs Time'!$A$3*O73)*'Option vs Time'!$A$9*T73,-1*'Option vs Time'!$A$6*S73+EXP(-1*'Option vs Time'!$A$3*O73)*'Option vs Time'!$A$9*T73)","v":73.161984166192184},{"$f":"(LN('Option vs Time'!$A$6/'Option vs Time'!$A$9)+('Option vs Time'!$A$3+0.5*'Option vs Time'!$A$15^2)*O73)/('Option vs Time'!$A$15*SQRT(O73))","v":1.546370160764311},{"$f":"Q73-'Option vs Time'!$A$15*SQRT(O73)","v":0.36315418724130266},0.93899240184270327,0.64175514597862438,0.91357848572798162]
[null,null,null,36.000000999999997,{"$f":"IF($C$4, 'Other Graphs'!$A$6*H74-EXP(-1*'Other Graphs'!$A$3*D74)*'Other Graphs'!$A$9*I74,-1*'Other Graphs'!$A$6*H74+EXP(-1*'Other Graphs'!$A$3*D74)*'Other Graphs'!$A$9*I74)","v":83.539113477903257},{"$f":"(LN('Other Graphs'!$A$6/'Other Graphs'!$A$9)+('Other Graphs'!$A$3+0.5*'Other Graphs'!$A$15^2)*D74)/('Other Graphs'!$A$15*SQRT(D74))","v":1.6500000229166667},{"$f":"F74-'Other Graphs'!$A$15*SQRT(D74)","v":0.45000000625000025},0.95052853430992312,0.67364478196537358,{"$f":"(F74*SQRT(D74)+SQRT(F74^2*D74-2*D74*LN('Other Graphs'!$A$6/'Other Graphs'!$A$9)-2*Data!D74^2*'Other Graphs'!$A$3))/D74","v":0.35000000000000014},{"$f":"(F74*SQRT(D74)-SQRT(F74^2*D74-2*D74*LN('Other Graphs'!$A$6/'Other Graphs'!$A$9)-2*Data!D74^2*'Other Graphs'!$A$3))/D74","v":0.1999999999999999},null,null,null,36.000000999999997,{"$f":"IF($C$4, 'Option vs Time'!$A$6*S74-EXP(-1*'Option vs Time'!$A$3*O74)*'Option vs Time'!$A$9*T74,-1*'Option vs Time'!$A$6*S74+EXP(-1*'Option vs Time'!$A$3*O74)*'Option vs Time'!$A$9*T74)","v":74.075562651920166},{"$f":"(LN('Option vs Time'!$A$6/'Option vs Time'!$A$9)+('Option vs Time'!$A$3+0.5*'Option vs Time'!$A$15^2)*O74)/('Option vs Time'!$A$15*SQRT(O74))","v":1.5705748741828562},{"$f":"Q74-'Option vs Time'!$A$15*SQRT(O74)","v":0.37057485751618979},0.94185928500780225,0.64452289421603004,0.8819325671508409]
[null,null,null,37.000000999999997,{"$f":"IF($C$4, 'Other Graphs'!$A$6*H75-EXP(-1*'Other Graphs'!$A$3*D75)*'Other Graphs'!$A$9*I75,-1*'Other Graphs'!$A$6*H75+EXP(-1*'Other Graphs'!$A$3*D75)*'Other Graphs'!$A$9*I75)","v":84.445982483743336},{"$f":"(LN('Other Graphs'!$A$6/'Other Graphs'!$A$9)+('Other Graphs'!$A$3+0.5*'Other Graphs'!$A$15^2)*D75)/('Other Graphs'!$A$15*SQRT(D75))","v":1.6727597184368712},{"$f":"F75-'Other Graphs'!$A$15*SQRT(D75)","v":0.45620719593732861},0.95281269615605668,0.67587950433631527,{"$f":"(F75*SQRT(D75)+SQRT(F75^2*D75-2*D75*LN('Other Graphs'!$A$6/'Other Graphs'!$A$9)-2*Data!D75^2*'Other Graphs'!$A$3))/D75","v":0.35000000000000014},{"$f":"(F75*SQRT(D75)-SQRT(F75^2*D75-2*D75*LN('Other Graphs'!$A$6/'Other Graphs'!$A$9)-2*Data!D75^2*'Other Graphs'!$A$3))/D75","v":0.1999999999999999},null,null,null,37.000000999999997,{"$f":"IF($C$4, 'Option vs Time'!$A$6*S75-EXP(-1*'Option vs Time'!$A$3*O75)*'Option vs Time'!$A$9*T75,-1*'Option vs Time'!$A$6*S75+EXP(-1*'Option vs Time'!$A$3*O75)*'Option vs Time'!$A$9*T75)","v":74.957495219071006},{"$f":"(LN('Option vs Time'!$A$6/'Option vs Time'!$A$9)+('Option vs Time'!$A$3+0.5*'Option vs Time'!$A$15^2)*O75)/('Option vs Time'!$A$15*SQRT(O75))","v":1.5944152342969677},{"$f":"Q75-'Option vs Time'!$A$15*SQRT(O75)","v":0.37786271179742514},0.94457846874504692,0.64723370800161106,0.85144206557393431]
[null,null,null,38.000000999999997,{"$f":"IF($C$4, 'Other Graphs'!$A$6*H76-EXP(-1*'Other Graphs'!$A$3*D76)*'Other Graphs'!$A$9*I76,-1*'Other Graphs'!$A$6*H76+EXP(-1*'Other Graphs'!$A$3*D76)*'Other Graphs'!$A$9*I76)","v":85.32109925049815},{"$f":"(LN('Other Graphs'!$A$6/'Other Graphs'!$A$9)+('Other Graphs'!$A$3+0.5*'Other Graphs'!$A$15^2)*D76)/('Other Graphs'!$A$15*SQRT(D76))","v":1.6952138731219137},{"$f":"F76-'Other Graphs'!$A$15*SQRT(D76)","v":0.46233105630597637},0.95498257195102587,0.67807803409526057,{"$f":"(F76*SQRT(D76)+SQRT(F76^2*D76-2*D76*LN('Other Graphs'!$A$6/'Other Graphs'!$A$9)-2*Data!D76^2*'Other Graphs'!$A$3))/D76","v":0.35000000000000003},{"$f":"(F76*SQRT(D76)-SQRT(F76^2*D76-2*D76*LN('Other Graphs'!$A$6/'Other Graphs'!$A$9)-2*Data!D76^2*'Other Graphs'!$A$3))/D76","v":0.19999999999999996},null,null,null,38.000000999999997,{"$f":"IF($C$4, 'Option vs Time'!$A$6*S76-EXP(-1*'Option vs Time'!$A$3*O76)*'Option vs Time'!$A$9*T76,-1*'Option vs Time'!$A$6*S76+EXP(-1*'Option vs Time'!$A$3*O76)*'Option vs Time'!$A$9*T76)","v":75.808937284644941},{"$f":"(LN('Option vs Time'!$A$6/'Option vs Time'!$A$9)+('Option vs Time'!$A$3+0.5*'Option vs Time'!$A$15^2)*O76)/('Option vs Time'!$A$15*SQRT(O76))","v":1.6179071100586775},{"$f":"Q76-'Option vs Time'!$A$15*SQRT(O76)","v":0.38502429324274012},0.94715869111333362,0.64989029149628708,0.82205828465080799]
[null,null,null,39.000000999999997,{"$f":"IF($C$4, 'Other Graphs'!$A$6*H77-EXP(-1*'Other Graphs'!$A$3*D77)*'Other Graphs'!$A$9*I77,-1*'Other Graphs'!$A$6*H77+EXP(-1*'Other Graphs'!$A$3*D77)*'Other Graphs'!$A$9*I77)","v":86.165643025461321},{"$f":"(LN('Other Graphs'!$A$6/'Other Graphs'!$A$9)+('Other Graphs'!$A$3+0.5*'Other Graphs'!$A$15^2)*D77)/('Other Graphs'!$A$15*SQRT(D77))","v":1.7173744715771806},{"$f":"F77-'Other Graphs'!$A$15*SQRT(D77)","v":0.46837485588468564},0.95704461351768266,0.68024172706716246,{"$f":"(F77*SQRT(D77)+SQRT(F77^2*D77-2*D77*LN('Other Graphs'!$A$6/'Other Graphs'!$A$9)-2*Data!D77^2*'Other Graphs'!$A$3))/D77","v":0.35000000000000009},{"$f":"(F77*SQRT(D77)-SQRT(F77^2*D77-2*D77*LN('Other Graphs'!$A$6/'Other Graphs'!$A$9)-2*Data!D77^2*'Other Graphs'!$A$3))/D77","v":0.2},null,null,null,39.000000999999997,{"$f":"IF($C$4, 'Option vs Time'!$A$6*S77-EXP(-1*'Option vs Time'!$A$3*O77)*'Option vs Time'!$A$9*T77,-1*'Option vs Time'!$A$6*S77+EXP(-1*'Option vs Time'!$A$3*O77)*'Option vs Time'!$A$9*T77)","v":76.630995569295749},{"$f":"(LN('Option vs Time'!$A$6/'Option vs Time'!$A$9)+('Option vs Time'!$A$3+0.5*'Option vs Time'!$A$15^2)*O77)/('Option vs Time'!$A$15*SQRT(O77))","v":1.6410652569010167},{"$f":"Q77-'Option vs Time'!$A$15*SQRT(O77)","v":0.39206564120852172},0.94960806509834672,0.65249514318766244,0.79373532408237679]
[null,null,null,40.000000999999997,{"$f":"IF($C$4, 'Other Graphs'!$A$6*H78-EXP(-1*'Other Graphs'!$A$3*D78)*'Other Graphs'!$A$9*I78,-1*'Other Graphs'!$A$6*H78+EXP(-1*'Other Graphs'!$A$3*D78)*'Other Graphs'!$A$9*I78)","v":86.980742177617245},{"$f":"(LN('Other Graphs'!$A$6/'Other Graphs'!$A$9)+('Other Graphs'!$A$3+0.5*'Other Graphs'!$A$15^2)*D78)/('Other Graphs'!$A$15*SQRT(D78))","v":1.7392527348332676},{"$f":"F78-'Other Graphs'!$A$15*SQRT(D78)","v":0.47434165495452763},0.95900484141103592,0.68237185411512391,{"$f":"(F78*SQRT(D78)+SQRT(F78^2*D78-2*D78*LN('Other Graphs'!$A$6/'Other Graphs'!$A$9)-2*Data!D78^2*'Other Graphs'!$A$3))/D78","v":0.35000000000000014},{"$f":"(F78*SQRT(D78)-SQRT(F78^2*D78-2*D78*LN('Other Graphs'!$A$6/'Other Graphs'!$A$9)-2*Data!D78^2*'Other Graphs'!$A$3))/D78","v":0.19999999999999993},null,null,null,40.000000999999997,{"$f":"IF($C$4, 'Option vs Time'!$A$6*S78-EXP(-1*'Option vs Time'!$A$3*O78)*'Option vs Time'!$A$9*T78,-1*'Option vs Time'!$A$6*S78+EXP(-1*'Option vs Time'!$A$3*O78)*'Option vs Time'!$A$9*T78)","v":77.424730893378126},{"$f":"(LN('Option vs Time'!$A$6/'Option vs Time'!$A$9)+('Option vs Time'!$A$3+0.5*'Option vs Time'!$A$15^2)*O78)/('Option vs Time'!$A$15*SQRT(O78))","v":1.6639034226796721},{"$f":"Q78-'Option vs Time'!$A$15*SQRT(O78)","v":0.3989923428009321},0.9519341345336011,0.65505057681870138,0.76642983474371817]
[null,null,null,41.000000999999997,{"$f":"IF($C$4, 'Other Graphs'!$A$6*H79-EXP(-1*'Other Graphs'!$A$3*D79)*'Other Graphs'!$A$9*I79,-1*'Other Graphs'!$A$6*H79+EXP(-1*'Other Graphs'!$A$3*D79)*'Other Graphs'!$A$9*I79)","v":87.767477172153491},{"$f":"(LN('Other Graphs'!$A$6/'Other Graphs'!$A$9)+('Other Graphs'!$A$3+0.5*'Other Graphs'!$A$15^2)*D79)/('Other Graphs'!$A$15*SQRT(D79))","v":1.7608591867679255},{"$f":"F79-'Other Graphs'!$A$15*SQRT(D79)","v":0.48023432366397967},0.96086888038696094,0.68446960848279093,{"$f":"(F79*SQRT(D79)+SQRT(F79^2*D79-2*D79*LN('Other Graphs'!$A$6/'Other Graphs'!$A$9)-2*Data!D79^2*'Other Graphs'!$A$3))/D79","v":0.35},{"$f":"(F79*SQRT(D79)-SQRT(F79^2*D79-2*D79*LN('Other Graphs'!$A$6/'Other Graphs'!$A$9)-2*Data!D79^2*'Other Graphs'!$A$3))/D79","v":0.19999999999999996},null,null,null,41.000000999999997,{"$f":"IF($C$4, 'Option vs Time'!$A$6*S79-EXP(-1*'Option vs Time'!$A$3*O79)*'Option vs Time'!$A$9*T79,-1*'Option vs Time'!$A$6*S79+EXP(-1*'Option vs Time'!$A$3*O79)*'Option vs Time'!$A$9*T79)","v":78.191160728121844},{"$f":"(LN('Option vs Time'!$A$6/'Option vs Time'!$A$9)+('Option vs Time'!$A$3+0.5*'Option vs Time'!$A$15^2)*O79)/('Option vs Time'!$A$15*SQRT(O79))","v":1.68643444104394},{"$f":"Q79-'Option vs Time'!$A$15*SQRT(O79)","v":0.40580957793999417},0.95414392378224377,0.65755873969229439,0.74010080394494082]
[null,null,null,42.000000999999997,{"$f":"IF($C$4, 'Other Graphs'!$A$6*H80-EXP(-1*'Other Graphs'!$A$3*D80)*'Other Graphs'!$A$9*I80,-1*'Other Graphs'!$A$6*H80+EXP(-1*'Other Graphs'!$A$3*D80)*'Other Graphs'!$A$9*I80)","v":88.526883285448477},{"$f":"(LN('Other Graphs'!$A$6/'Other Graphs'!$A$9)+('Other Graphs'!$A$3+0.5*'Other Graphs'!$A$15^2)*D80)/('Other Graphs'!$A$15*SQRT(D80))","v":1.7822037132788722},{"$f":"F80-'Other Graphs'!$A$15*SQRT(D80)","v":0.48605555816696522},0.96264199125227301,0.68653611233819423,{"$f":"(F80*SQRT(D80)+SQRT(F80^2*D80-2*D80*LN('Other Graphs'!$A$6/'Other Graphs'!$A$9)-2*Data!D80^2*'Other Graphs'!$A$3))/D80","v":0.35000000000000014},{"$f":"(F80*SQRT(D80)-SQRT(F80^2*D80-2*D80*LN('Other Graphs'!$A$6/'Other Graphs'!$A$9)-2*Data!D80^2*'Other Graphs'!$A$3))/D80","v":0.1999999999999999},null,null,null,42.000000999999997,{"$f":"IF($C$4, 'Option vs Time'!$A$6*S80-EXP(-1*'Option vs Time'!$A$3*O80)*'Option vs Time'!$A$9*T80,-1*'Option vs Time'!$A$6*S80+EXP(-1*'Option vs Time'!$A$3*O80)*'Option vs Time'!$A$9*T80)","v":78.931261532066785},{"$f":"(LN('Option vs Time'!$A$6/'Option vs Time'!$A$9)+('Option vs Time'!$A$3+0.5*'Option vs Time'!$A$15^2)*O80)/('Option vs Time'!$A$15*SQRT(O80))","v":1.7086703140077866},{"$f":"Q80-'Option vs Time'!$A$15*SQRT(O80)","v":0.41252215889587962},0.95624398202168348,0.66002162873865489,0.71470936627127912]
[null,null,null,43.000000999999997,{"$f":"IF($C$4, 'Other Graphs'!$A$6*H81-EXP(-1*'Other Graphs'!$A$3*D81)*'Other Graphs'!$A$9*I81,-1*'Other Graphs'!$A$6*H81+EXP(-1*'Other Graphs'!$A$3*D81)*'Other Graphs'!$A$9*I81)","v":89.259953091859572},{"$f":"(LN('Other Graphs'!$A$6/'Other Graphs'!$A$9)+('Other Graphs'!$A$3+0.5*'Other Graphs'!$A$15^2)*D81)/('Other Graphs'!$A$15*SQRT(D81))","v":1.8032956151516035},{"$f":"F81-'Other Graphs'!$A$15*SQRT(D81)","v":0.49180789504134625},0.96432909954430757,0.68857242262281537,{"$f":"(F81*SQRT(D81)+SQRT(F81^2*D81-2*D81*LN('Other Graphs'!$A$6/'Other Graphs'!$A$9)-2*Data!D81^2*'Other Graphs'!$A$3))/D81","v":0.35000000000000009},{"$f":"(F81*SQRT(D81)-SQRT(F81^2*D81-2*D81*LN('Other Graphs'!$A$6/'Other Graphs'!$A$9)-2*Data!D81^2*'Other Graphs'!$A$3))/D81","v":0.19999999999999998},null,null,null,43.000000999999997,{"$f":"IF($C$4, 'Option vs Time'!$A$6*S81-EXP(-1*'Option vs Time'!$A$3*O81)*'Option vs Time'!$A$9*T81,-1*'Option vs Time'!$A$6*S81+EXP(-1*'Option vs Time'!$A$3*O81)*'Option vs Time'!$A$9*T81)","v":79.645970898338064},{"$f":"(LN('Option vs Time'!$A$6/'Option vs Time'!$A$9)+('Option vs Time'!$A$3+0.5*'Option vs Time'!$A$15^2)*O81)/('Option vs Time'!$A$15*SQRT(O81))","v":1.7306222852051272},{"$f":"Q81-'Option vs Time'!$A$15*SQRT(O81)","v":0.4191345650948699},0.95824042284048572,0.66244110466738593,0.69021863623522961]
[null,null,null,44.000000999999997,{"$f":"IF($C$4, 'Other Graphs'!$A$6*H82-EXP(-1*'Other Graphs'!$A$3*D82)*'Other Graphs'!$A$9*I82,-1*'Other Graphs'!$A$6*H82+EXP(-1*'Other Graphs'!$A$3*D82)*'Other Graphs'!$A$9*I82)","v":89.967638749005914},{"$f":"(LN('Other Graphs'!$A$6/'Other Graphs'!$A$9)+('Other Graphs'!$A$3+0.5*'Other Graphs'!$A$15^2)*D82)/('Other Graphs'!$A$15*SQRT(D82))","v":1.8241436554243746},{"$f":"F82-'Other Graphs'!$A$15*SQRT(D82)","v":0.4974937242066475},0.96593482142296705,0.69057953629407831,{"$f":"(F82*SQRT(D82)+SQRT(F82^2*D82-2*D82*LN('Other Graphs'!$A$6/'Other Graphs'!$A$9)-2*Data!D82^2*'Other Graphs'!$A$3))/D82","v":0.34999999999999992},{"$f":"(F82*SQRT(D82)-SQRT(F82^2*D82-2*D82*LN('Other Graphs'!$A$6/'Other Graphs'!$A$9)-2*Data!D82^2*'Other Graphs'!$A$3))/D82","v":0.20000000000000009},null,null,null,44.000000999999997,{"$f":"IF($C$4, 'Option vs Time'!$A$6*S82-EXP(-1*'Option vs Time'!$A$3*O82)*'Option vs Time'!$A$9*T82,-1*'Option vs Time'!$A$6*S82+EXP(-1*'Option vs Time'!$A$3*O82)*'Option vs Time'!$A$9*T82)","v":80.336189534573293},{"$f":"(LN('Option vs Time'!$A$6/'Option vs Time'!$A$9)+('Option vs Time'!$A$3+0.5*'Option vs Time'!$A$15^2)*O82)/('Option vs Time'!$A$15*SQRT(O82))","v":1.7523009050788936},{"$f":"Q82-'Option vs Time'!$A$15*SQRT(O82)","v":0.42565097386116646},0.9601389597480211,0.66481890447319958,0.66659355960864275]
[null,null,null,45.000000999999997,{"$f":"IF($C$4, 'Other Graphs'!$A$6*H83-EXP(-1*'Other Graphs'!$A$3*D83)*'Other Graphs'!$A$9*I83,-1*'Other Graphs'!$A$6*H83+EXP(-1*'Other Graphs'!$A$3*D83)*'Other Graphs'!$A$9*I83)","v":90.650854104392124},{"$f":"(LN('Other Graphs'!$A$6/'Other Graphs'!$A$9)+('Other Graphs'!$A$3+0.5*'Other Graphs'!$A$15^2)*D83)/('Other Graphs'!$A$15*SQRT(D83))","v":1.8447561019346164},{"$f":"F83-'Other Graphs'!$A$15*SQRT(D83)","v":0.50311530052762277},0.96746348710381935,0.69255839503651506,{"$f":"(F83*SQRT(D83)+SQRT(F83^2*D83-2*D83*LN('Other Graphs'!$A$6/'Other Graphs'!$A$9)-2*Data!D83^2*'Other Graphs'!$A$3))/D83","v":0.3500000000000002},{"$f":"(F83*SQRT(D83)-SQRT(F83^2*D83-2*D83*LN('Other Graphs'!$A$6/'Other Graphs'!$A$9)-2*Data!D83^2*'Other Graphs'!$A$3))/D83","v":0.1999999999999999},null,null,null,45.000000999999997,{"$f":"IF($C$4, 'Option vs Time'!$A$6*S83-EXP(-1*'Option vs Time'!$A$3*O83)*'Option vs Time'!$A$9*T83,-1*'Option vs Time'!$A$6*S83+EXP(-1*'Option vs Time'!$A$3*O83)*'Option vs Time'!$A$9*T83)","v":81.002783094181936},{"$f":"(LN('Option vs Time'!$A$6/'Option vs Time'!$A$9)+('Option vs Time'!$A$3+0.5*'Option vs Time'!$A$15^2)*O83)/('Option vs Time'!$A$15*SQRT(O83))","v":1.7737160890605506},{"$f":"Q83-'Option vs Time'!$A$15*SQRT(O83)","v":0.43207528765355696},0.96194493810739723,0.66715665252109724,0.64380078081943282]
[null,null,null,46.000000999999997,{"$f":"IF($C$4, 'Other Graphs'!$A$6*H84-EXP(-1*'Other Graphs'!$A$3*D84)*'Other Graphs'!$A$9*I84,-1*'Other Graphs'!$A$6*H84+EXP(-1*'Other Graphs'!$A$3*D84)*'Other Graphs'!$A$9*I84)","v":91.310476643006837},{"$f":"(LN('Other Graphs'!$A$6/'Other Graphs'!$A$9)+('Other Graphs'!$A$3+0.5*'Other Graphs'!$A$15^2)*D84)/('Other Graphs'!$A$15*SQRT(D84))","v":1.8651407656327177},{"$f":"F84-'Other Graphs'!$A$15*SQRT(D84)","v":0.50867475426346842},0.96891916211527573,0.69450988950606696,{"$f":"(F84*SQRT(D84)+SQRT(F84^2*D84-2*D84*LN('Other Graphs'!$A$6/'Other Graphs'!$A$9)-2*Data!D84^2*'Other Graphs'!$A$3))/D84","v":0.35000000000000009},{"$f":"(F84*SQRT(D84)-SQRT(F84^2*D84-2*D84*LN('Other Graphs'!$A$6/'Other Graphs'!$A$9)-2*Data!D84^2*'Other Graphs'!$A$3))/D84","v":0.19999999999999996},null,null,null,46.000000999999997,{"$f":"IF($C$4, 'Option vs Time'!$A$6*S84-EXP(-1*'Option vs Time'!$A$3*O84)*'Option vs Time'!$A$9*T84,-1*'Option vs Time'!$A$6*S84+EXP(-1*'Option vs Time'!$A$3*O84)*'Option vs Time'!$A$9*T84)","v":81.646583875001369},{"$f":"(LN('Option vs Time'!$A$6/'Option vs Time'!$A$9)+('Option vs Time'!$A$3+0.5*'Option vs Time'!$A$15^2)*O84)/('Option vs Time'!$A$15*SQRT(O84))","v":1.7948771696373294},{"$f":"Q84-'Option vs Time'!$A$15*SQRT(O84)","v":0.43841115826808008},0.9636633639275517,0.66945587040141419,0.62180852421997201]
[null,null,null,47.000000999999997,{"$f":"IF($C$4, 'Other Graphs'!$A$6*H85-EXP(-1*'Other Graphs'!$A$3*D85)*'Other Graphs'!$A$9*I85,-1*'Other Graphs'!$A$6*H85+EXP(-1*'Other Graphs'!$A$3*D85)*'Other Graphs'!$A$9*I85)","v":91.947349292838723},{"$f":"(LN('Other Graphs'!$A$6/'Other Graphs'!$A$9)+('Other Graphs'!$A$3+0.5*'Other Graphs'!$A$15^2)*D85)/('Other Graphs'!$A$15*SQRT(D85))","v":1.8853050351667233},{"$f":"F85-'Other Graphs'!$A$15*SQRT(D85)","v":0.51417410050001533},0.97030566662453677,0.6964348631629268,{"$f":"(F85*SQRT(D85)+SQRT(F85^2*D85-2*D85*LN('Other Graphs'!$A$6/'Other Graphs'!$A$9)-2*Data!D85^2*'Other Graphs'!$A$3))/D85","v":0.35000000000000003},{"$f":"(F85*SQRT(D85)-SQRT(F85^2*D85-2*D85*LN('Other Graphs'!$A$6/'Other Graphs'!$A$9)-2*Data!D85^2*'Other Graphs'!$A$3))/D85","v":0.20000000000000004},null,null,null,47.000000999999997,{"$f":"IF($C$4, 'Option vs Time'!$A$6*S85-EXP(-1*'Option vs Time'!$A$3*O85)*'Option vs Time'!$A$9*T85,-1*'Option vs Time'!$A$6*S85+EXP(-1*'Option vs Time'!$A$3*O85)*'Option vs Time'!$A$9*T85)","v":82.268392399221341},{"$f":"(LN('Option vs Time'!$A$6/'Option vs Time'!$A$9)+('Option vs Time'!$A$3+0.5*'Option vs Time'!$A$15^2)*O85)/('Option vs Time'!$A$15*SQRT(O85))","v":1.8157929430721105},{"$f":"Q85-'Option vs Time'!$A$15*SQRT(O85)","v":0.44466200840540249},0.96529892988815236,0.671717985715928,0.6005864873805109]
[null,null,null,48.000000999999997,{"$f":"IF($C$4, 'Other Graphs'!$A$6*H86-EXP(-1*'Other Graphs'!$A$3*D86)*'Other Graphs'!$A$9*I86,-1*'Other Graphs'!$A$6*H86+EXP(-1*'Other Graphs'!$A$3*D86)*'Other Graphs'!$A$9*I86)","v":92.562282102985591},{"$f":"(LN('Other Graphs'!$A$6/'Other Graphs'!$A$9)+('Other Graphs'!$A$3+0.5*'Other Graphs'!$A$15^2)*D86)/('Other Graphs'!$A$15*SQRT(D86))","v":1.9052559081721803},{"$f":"F86-'Other Graphs'!$A$15*SQRT(D86)","v":0.51961524768332157},0.97162659304459054,0.69833411574071502,{"$f":"(F86*SQRT(D86)+SQRT(F86^2*D86-2*D86*LN('Other Graphs'!$A$6/'Other Graphs'!$A$9)-2*Data!D86^2*'Other Graphs'!$A$3))/D86","v":0.34999999999999992},{"$f":"(F86*SQRT(D86)-SQRT(F86^2*D86-2*D86*LN('Other Graphs'!$A$6/'Other Graphs'!$A$9)-2*Data!D86^2*'Other Graphs'!$A$3))/D86","v":0.20000000000000004},null,null,null,48.000000999999997,{"$f":"IF($C$4, 'Option vs Time'!$A$6*S86-EXP(-1*'Option vs Time'!$A$3*O86)*'Option vs Time'!$A$9*T86,-1*'Option vs Time'!$A$6*S86+EXP(-1*'Option vs Time'!$A$3*O86)*'Option vs Time'!$A$9*T86)","v":82.868978886601852},{"$f":"(LN('Option vs Time'!$A$6/'Option vs Time'!$A$9)+('Option vs Time'!$A$3+0.5*'Option vs Time'!$A$15^2)*O86)/('Option vs Time'!$A$15*SQRT(O86))","v":1.8364717114305091},{"$f":"Q86-'Option vs Time'!$A$15*SQRT(O86)","v":0.45083105094165044},0.9668560389188291,0.67394433993204228,0.58010574484498534]
[null,null,null,49.000000999999997,{"$f":"IF($C$4, 'Other Graphs'!$A$6*H87-EXP(-1*'Other Graphs'!$A$3*D87)*'Other Graphs'!$A$9*I87,-1*'Other Graphs'!$A$6*H87+EXP(-1*'Other Graphs'!$A$3*D87)*'Other Graphs'!$A$9*I87)","v":93.156053807116734},{"$f":"(LN('Other Graphs'!$A$6/'Other Graphs'!$A$9)+('Other Graphs'!$A$3+0.5*'Other Graphs'!$A$15^2)*D87)/('Other Graphs'!$A$15*SQRT(D87))","v":1.9250000196428572},{"$f":"F87-'Other Graphs'!$A$15*SQRT(D87)","v":0.52500000535714286},0.97288532210705769,0.70020840639335735,{"$f":"(F87*SQRT(D87)+SQRT(F87^2*D87-2*D87*LN('Other Graphs'!$A$6/'Other Graphs'!$A$9)-2*Data!D87^2*'Other Graphs'!$A$3))/D87","v":0.35},{"$f":"(F87*SQRT(D87)-SQRT(F87^2*D87-2*D87*LN('Other Graphs'!$A$6/'Other Graphs'!$A$9)-2*Data!D87^2*'Other Graphs'!$A$3))/D87","v":0.2},null,null,null,49.000000999999997,{"$f":"IF($C$4, 'Option vs Time'!$A$6*S87-EXP(-1*'Option vs Time'!$A$3*O87)*'Option vs Time'!$A$9*T87,-1*'Option vs Time'!$A$6*S87+EXP(-1*'Option vs Time'!$A$3*O87)*'Option vs Time'!$A$9*T87)","v":83.449084631446837},{"$f":"(LN('Option vs Time'!$A$6/'Option vs Time'!$A$9)+('Option vs Time'!$A$3+0.5*'Option vs Time'!$A$15^2)*O87)/('Option vs Time'!$A$15*SQRT(O87))","v":1.8569213204773058},{"$f":"Q87-'Option vs Time'!$A$15*SQRT(O87)","v":0.45692130619159155},0.96833882561042339,0.67613619542194081,0.56033866102590935]
[null,null,null,50.000000999999997,{"$f":"IF($C$4, 'Other Graphs'!$A$6*H88-EXP(-1*'Other Graphs'!$A$3*D88)*'Other Graphs'!$A$9*I88,-1*'Other Graphs'!$A$6*H88+EXP(-1*'Other Graphs'!$A$3*D88)*'Other Graphs'!$A$9*I88)","v":93.729413283424051},{"$f":"(LN('Other Graphs'!$A$6/'Other Graphs'!$A$9)+('Other Graphs'!$A$3+0.5*'Other Graphs'!$A$15^2)*D88)/('Other Graphs'!$A$15*SQRT(D88))","v":1.9445436677084422},{"$f":"F88-'Other Graphs'!$A$15*SQRT(D88)","v":0.53033009119321162},0.97408503756226861,0.70205845655557275,{"$f":"(F88*SQRT(D88)+SQRT(F88^2*D88-2*D88*LN('Other Graphs'!$A$6/'Other Graphs'!$A$9)-2*Data!D88^2*'Other Graphs'!$A$3))/D88","v":0.35000000000000009},{"$f":"(F88*SQRT(D88)-SQRT(F88^2*D88-2*D88*LN('Other Graphs'!$A$6/'Other Graphs'!$A$9)-2*Data!D88^2*'Other Graphs'!$A$3))/D88","v":0.19999999999999998},null,null,null,50.000000999999997,{"$f":"IF($C$4, 'Option vs Time'!$A$6*S88-EXP(-1*'Option vs Time'!$A$3*O88)*'Option vs Time'!$A$9*T88,-1*'Option vs Time'!$A$6*S88+EXP(-1*'Option vs Time'!$A$3*O88)*'Option vs Time'!$A$9*T88)","v":84.009423292472746},{"$f":"(LN('Option vs Time'!$A$6/'Option vs Time'!$A$9)+('Option vs Time'!$A$3+0.5*'Option vs Time'!$A$15^2)*O88)/('Option vs Time'!$A$15*SQRT(O88))","v":1.8771491939266398},{"$f":"Q88-'Option vs Time'!$A$15*SQRT(O88)","v":0.46293561741140921},0.96975117569892644,0.67829474178679494,0.54125881110768148]
[null,null,null,51.000000999999997,{"$f":"IF($C$4, 'Other Graphs'!$A$6*H89-EXP(-1*'Other Graphs'!$A$3*D89)*'Other Graphs'!$A$9*I89,-1*'Other Graphs'!$A$6*H89+EXP(-1*'Other Graphs'!$A$3*D89)*'Other Graphs'!$A$9*I89)","v":94.283080920812509},{"$f":"(LN('Other Graphs'!$A$6/'Other Graphs'!$A$9)+('Other Graphs'!$A$3+0.5*'Other Graphs'!$A$15^2)*D89)/('Other Graphs'!$A$15*SQRT(D89))","v":1.9638928371031348},{"$f":"F89-'Other Graphs'!$A$15*SQRT(D89)","v":0.53560713739176391},0.97522873964793932,0.70388495254824768,{"$f":"(F89*SQRT(D89)+SQRT(F89^2*D89-2*D89*LN('Other Graphs'!$A$6/'Other Graphs'!$A$9)-2*Data!D89^2*'Other Graphs'!$A$3))/D89","v":0.35},{"$f":"(F89*SQRT(D89)-SQRT(F89^2*D89-2*D89*LN('Other Graphs'!$A$6/'Other Graphs'!$A$9)-2*Data!D89^2*'Other Graphs'!$A$3))/D89","v":0.20000000000000004},null,null,null,51.000000999999997,{"$f":"IF($C$4, 'Option vs Time'!$A$6*S89-EXP(-1*'Option vs Time'!$A$3*O89)*'Option vs Time'!$A$9*T89,-1*'Option vs Time'!$A$6*S89+EXP(-1*'Option vs Time'!$A$3*O89)*'Option vs Time'!$A$9*T89)","v":84.550682103580428},{"$f":"(LN('Option vs Time'!$A$6/'Option vs Time'!$A$9)+('Option vs Time'!$A$3+0.5*'Option vs Time'!$A$15^2)*O89)/('Option vs Time'!$A$15*SQRT(O89))","v":1.8971623644647928},{"$f":"Q89-'Option vs Time'!$A$15*SQRT(O89)","v":0.46887666475342193},0.97109674383138789,0.68042110155201596,0.52284090899402713]
[null,null,null,52.000000999999997,{"$f":"IF($C$4, 'Other Graphs'!$A$6*H90-EXP(-1*'Other Graphs'!$A$3*D90)*'Other Graphs'!$A$9*I90,-1*'Other Graphs'!$A$6*H90+EXP(-1*'Other Graphs'!$A$3*D90)*'Other Graphs'!$A$9*I90)","v":94.817749899898701},{"$f":"(LN('Other Graphs'!$A$6/'Other Graphs'!$A$9)+('Other Graphs'!$A$3+0.5*'Other Graphs'!$A$15^2)*D90)/('Other Graphs'!$A$15*SQRT(D90))","v":1.9830532205730136},{"$f":"F90-'Other Graphs'!$A$15*SQRT(D90)","v":0.54083269651991306},0.97631925745065573,0.70568854795600822,{"$f":"(F90*SQRT(D90)+SQRT(F90^2*D90-2*D90*LN('Other Graphs'!$A$6/'Other Graphs'!$A$9)-2*Data!D90^2*'Other Graphs'!$A$3))/D90","v":0.3500000000000002},{"$f":"(F90*SQRT(D90)-SQRT(F90^2*D90-2*D90*LN('Other Graphs'!$A$6/'Other Graphs'!$A$9)-2*Data!D90^2*'Other Graphs'!$A$3))/D90","v":0.1999999999999999},null,null,null,52.000000999999997,{"$f":"IF($C$4, 'Option vs Time'!$A$6*S90-EXP(-1*'Option vs Time'!$A$3*O90)*'Option vs Time'!$A$9*T90,-1*'Option vs Time'!$A$6*S90+EXP(-1*'Option vs Time'!$A$3*O90)*'Option vs Time'!$A$9*T90)","v":85.073523012574455},{"$f":"(LN('Option vs Time'!$A$6/'Option vs Time'!$A$9)+('Option vs Time'!$A$3+0.5*'Option vs Time'!$A$15^2)*O90)/('Option vs Time'!$A$15*SQRT(O90))","v":1.9169675019088022},{"$f":"Q90-'Option vs Time'!$A$15*SQRT(O90)","v":0.47474697785570164},0.97237896979636518,0.68251633530766642,0.5050607414720929]
[null,null,null,53.000000999999997,{"$f":"IF($C$4, 'Other Graphs'!$A$6*H91-EXP(-1*'Other Graphs'!$A$3*D91)*'Other Graphs'!$A$9*I91,-1*'Other Graphs'!$A$6*H91+EXP(-1*'Other Graphs'!$A$3*D91)*'Other Graphs'!$A$9*I91)","v":95.334087396370705},{"$f":"(LN('Other Graphs'!$A$6/'Other Graphs'!$A$9)+('Other Graphs'!$A$3+0.5*'Other Graphs'!$A$15^2)*D91)/('Other Graphs'!$A$15*SQRT(D91))","v":2.0020302384392199},{"$f":"F91-'Other Graphs'!$A$15*SQRT(D91)","v":0.54600824684705973},0.97735926026959463,0.70746986580090687,{"$f":"(F91*SQRT(D91)+SQRT(F91^2*D91-2*D91*LN('Other Graphs'!$A$6/'Other Graphs'!$A$9)-2*Data!D91^2*'Other Graphs'!$A$3))/D91","v":0.34999999999999987},{"$f":"(F91*SQRT(D91)-SQRT(F91^2*D91-2*D91*LN('Other Graphs'!$A$6/'Other Graphs'!$A$9)-2*Data!D91^2*'Other Graphs'!$A$3))/D91","v":0.20000000000000015},null,null,null,53.000000999999997,{"$f":"IF($C$4, 'Option vs Time'!$A$6*S91-EXP(-1*'Option vs Time'!$A$3*O91)*'Option vs Time'!$A$9*T91,-1*'Option vs Time'!$A$6*S91+EXP(-1*'Option vs Time'!$A$3*O91)*'Option vs Time'!$A$9*T91)","v":85.578583754046548},{"$f":"(LN('Option vs Time'!$A$6/'Option vs Time'!$A$9)+('Option vs Time'!$A$3+0.5*'Option vs Time'!$A$15^2)*O91)/('Option vs Time'!$A$15*SQRT(O91))","v":1.9365709388168955},{"$f":"Q91-'Option vs Time'!$A$15*SQRT(O91)","v":0.48054894722473529},0.9736010933786764,0.68458144635812002,0.48789510787970869]
[null,null,null,54.000000999999997,{"$f":"IF($C$4, 'Other Graphs'!$A$6*H92-EXP(-1*'Other Graphs'!$A$3*D92)*'Other Graphs'!$A$9*I92,-1*'Other Graphs'!$A$6*H92+EXP(-1*'Other Graphs'!$A$3*D92)*'Other Graphs'!$A$9*I92)","v":95.83273571339069},{"$f":"(LN('Other Graphs'!$A$6/'Other Graphs'!$A$9)+('Other Graphs'!$A$3+0.5*'Other Graphs'!$A$15^2)*D92)/('Other Graphs'!$A$15*SQRT(D92))","v":2.0208290565075018},{"$f":"F92-'Other Graphs'!$A$15*SQRT(D92)","v":0.55113519722931859},0.97835126807916328,0.70922950053323697,{"$f":"(F92*SQRT(D92)+SQRT(F92^2*D92-2*D92*LN('Other Graphs'!$A$6/'Other Graphs'!$A$9)-2*Data!D92^2*'Other Graphs'!$A$3))/D92","v":0.35},{"$f":"(F92*SQRT(D92)-SQRT(F92^2*D92-2*D92*LN('Other Graphs'!$A$6/'Other Graphs'!$A$9)-2*Data!D92^2*'Other Graphs'!$A$3))/D92","v":0.2},null,null,null,54.000000999999997,{"$f":"IF($C$4, 'Option vs Time'!$A$6*S92-EXP(-1*'Option vs Time'!$A$3*O92)*'Option vs Time'!$A$9*T92,-1*'Option vs Time'!$A$6*S92+EXP(-1*'Option vs Time'!$A$3*O92)*'Option vs Time'!$A$9*T92)","v":86.066478861926257},{"$f":"(LN('Option vs Time'!$A$6/'Option vs Time'!$A$9)+('Option vs Time'!$A$3+0.5*'Option vs Time'!$A$15^2)*O92)/('Option vs Time'!$A$15*SQRT(O92))","v":1.9559786938264367},{"$f":"Q92-'Option vs Time'!$A$15*SQRT(O92)","v":0.48628483454825355},0.974766167978665,0.68661738493655655,0.47132176466180908]
[null,null,null,55.000000999999997,{"$f":"IF($C$4, 'Other Graphs'!$A$6*H93-EXP(-1*'Other Graphs'!$A$3*D93)*'Other Graphs'!$A$9*I93,-1*'Other Graphs'!$A$6*H93+EXP(-1*'Other Graphs'!$A$3*D93)*'Other Graphs'!$A$9*I93)","v":96.314313348966948},{"$f":"(LN('Other Graphs'!$A$6/'Other Graphs'!$A$9)+('Other Graphs'!$A$3+0.5*'Other Graphs'!$A$15^2)*D93)/('Other Graphs'!$A$15*SQRT(D93))","v":2.0394546024918037},{"$f":"F93-'Other Graphs'!$A$15*SQRT(D93)","v":0.55621489158867377},0.97929766117618799,0.71096801985795521,{"$f":"(F93*SQRT(D93)+SQRT(F93^2*D93-2*D93*LN('Other Graphs'!$A$6/'Other Graphs'!$A$9)-2*Data!D93^2*'Other Graphs'!$A$3))/D93","v":0.35000000000000014},{"$f":"(F93*SQRT(D93)-SQRT(F93^2*D93-2*D93*LN('Other Graphs'!$A$6/'Other Graphs'!$A$9)-2*Data!D93^2*'Other Graphs'!$A$3))/D93","v":0.19999999999999993},null,null,null,55.000000999999997,{"$f":"IF($C$4, 'Option vs Time'!$A$6*S93-EXP(-1*'Option vs Time'!$A$3*O93)*'Option vs Time'!$A$9*T93,-1*'Option vs Time'!$A$6*S93+EXP(-1*'Option vs Time'!$A$3*O93)*'Option vs Time'!$A$9*T93)","v":86.537800626588066},{"$f":"(LN('Option vs Time'!$A$6/'Option vs Time'!$A$9)+('Option vs Time'!$A$3+0.5*'Option vs Time'!$A$15^2)*O93)/('Option vs Time'!$A$15*SQRT(O93))","v":1.9751964929605457},{"$f":"Q93-'Option vs Time'!$A$15*SQRT(O93)","v":0.49195678205741578},0.97587707311937444,0.68862505203263291,0.4553193742820838]
[null,null,null,56.000000999999997,{"$f":"IF($C$4, 'Other Graphs'!$A$6*H94-EXP(-1*'Other Graphs'!$A$3*D94)*'Other Graphs'!$A$9*I94,-1*'Other Graphs'!$A$6*H94+EXP(-1*'Other Graphs'!$A$3*D94)*'Other Graphs'!$A$9*I94)","v":96.77941600357093},{"$f":"(LN('Other Graphs'!$A$6/'Other Graphs'!$A$9)+('Other Graphs'!$A$3+0.5*'Other Graphs'!$A$15^2)*D94)/('Other Graphs'!$A$15*SQRT(D94))","v":2.0579115810998783},{"$f":"F94-'Other Graphs'!$A$15*SQRT(D94)","v":0.56124861302723961},0.98020068908769231,0.7126859664130436,{"$f":"(F94*SQRT(D94)+SQRT(F94^2*D94-2*D94*LN('Other Graphs'!$A$6/'Other Graphs'!$A$9)-2*Data!D94^2*'Other Graphs'!$A$3))/D94","v":0.35000000000000009},{"$f":"(F94*SQRT(D94)-SQRT(F94^2*D94-2*D94*LN('Other Graphs'!$A$6/'Other Graphs'!$A$9)-2*Data!D94^2*'Other Graphs'!$A$3))/D94","v":0.1999999999999999},null,null,null,56.000000999999997,{"$f":"IF($C$4, 'Option vs Time'!$A$6*S94-EXP(-1*'Option vs Time'!$A$3*O94)*'Option vs Time'!$A$9*T94,-1*'Option vs Time'!$A$6*S94+EXP(-1*'Option vs Time'!$A$3*O94)*'Option vs Time'!$A$9*T94)","v":86.99312000087015},{"$f":"(LN('Option vs Time'!$A$6/'Option vs Time'!$A$9)+('Option vs Time'!$A$3+0.5*'Option vs Time'!$A$15^2)*O94)/('Option vs Time'!$A$15*SQRT(O94))","v":1.9942297891149647},{"$f":"Q94-'Option vs Time'!$A$15*SQRT(O94)","v":0.49756682104232608},0.97693652595053304,0.69060530287550548,0.43986745802774863]
[null,null,null,57.000000999999997,{"$f":"IF($C$4, 'Other Graphs'!$A$6*H95-EXP(-1*'Other Graphs'!$A$3*D95)*'Other Graphs'!$A$9*I95,-1*'Other Graphs'!$A$6*H95+EXP(-1*'Other Graphs'!$A$3*D95)*'Other Graphs'!$A$9*I95)","v":97.228617532706792},{"$f":"(LN('Other Graphs'!$A$6/'Other Graphs'!$A$9)+('Other Graphs'!$A$3+0.5*'Other Graphs'!$A$15^2)*D95)/('Other Graphs'!$A$15*SQRT(D95))","v":2.076204487911776},{"$f":"F95-'Other Graphs'!$A$15*SQRT(D95)","v":0.56623758761230247},0.98106247880694475,0.7143838593142402,{"$f":"(F95*SQRT(D95)+SQRT(F95^2*D95-2*D95*LN('Other Graphs'!$A$6/'Other Graphs'!$A$9)-2*Data!D95^2*'Other Graphs'!$A$3))/D95","v":0.35000000000000003},{"$f":"(F95*SQRT(D95)-SQRT(F95^2*D95-2*D95*LN('Other Graphs'!$A$6/'Other Graphs'!$A$9)-2*Data!D95^2*'Other Graphs'!$A$3))/D95","v":0.2},null,null,null,57.000000999999997,{"$f":"IF($C$4, 'Option vs Time'!$A$6*S95-EXP(-1*'Option vs Time'!$A$3*O95)*'Option vs Time'!$A$9*T95,-1*'Option vs Time'!$A$6*S95+EXP(-1*'Option vs Time'!$A$3*O95)*'Option vs Time'!$A$9*T95)","v":87.432987458897898},{"$f":"(LN('Option vs Time'!$A$6/'Option vs Time'!$A$9)+('Option vs Time'!$A$3+0.5*'Option vs Time'!$A$15^2)*O95)/('Option vs Time'!$A$15*SQRT(O95))","v":2.0130837799112089},{"$f":"Q95-'Option vs Time'!$A$15*SQRT(O95)","v":0.50311687961173535},0.97794709184569784,0.69255895010907798,0.42494635230353595]
[null,null,null,58.000000999999997,{"$f":"IF($C$4, 'Other Graphs'!$A$6*H96-EXP(-1*'Other Graphs'!$A$3*D96)*'Other Graphs'!$A$9*I96,-1*'Other Graphs'!$A$6*H96+EXP(-1*'Other Graphs'!$A$3*D96)*'Other Graphs'!$A$9*I96)","v":97.662470848648013},{"$f":"(LN('Other Graphs'!$A$6/'Other Graphs'!$A$9)+('Other Graphs'!$A$3+0.5*'Other Graphs'!$A$15^2)*D96)/('Other Graphs'!$A$15*SQRT(D96))","v":2.0943376221672096},{"$f":"F96-'Other Graphs'!$A$15*SQRT(D96)","v":0.57118298786378485},0.98188504241815922,0.71606219557894479,{"$f":"(F96*SQRT(D96)+SQRT(F96^2*D96-2*D96*LN('Other Graphs'!$A$6/'Other Graphs'!$A$9)-2*Data!D96^2*'Other Graphs'!$A$3))/D96","v":0.3500000000000002},{"$f":"(F96*SQRT(D96)-SQRT(F96^2*D96-2*D96*LN('Other Graphs'!$A$6/'Other Graphs'!$A$9)-2*Data!D96^2*'Other Graphs'!$A$3))/D96","v":0.19999999999999987},null,null,null,58.000000999999997,{"$f":"IF($C$4, 'Option vs Time'!$A$6*S96-EXP(-1*'Option vs Time'!$A$3*O96)*'Option vs Time'!$A$9*T96,-1*'Option vs Time'!$A$6*S96+EXP(-1*'Option vs Time'!$A$3*O96)*'Option vs Time'!$A$9*T96)","v":87.857933811201434},{"$f":"(LN('Option vs Time'!$A$6/'Option vs Time'!$A$9)+('Option vs Time'!$A$3+0.5*'Option vs Time'!$A$15^2)*O96)/('Option vs Time'!$A$15*SQRT(O96))","v":2.0317634240800193},{"$f":"Q96-'Option vs Time'!$A$15*SQRT(O96)","v":0.50860878977659452},0.97891119417802108,0.69448676669181542,0.41053716806274565]
[null,null,null,59.000000999999997,{"$f":"IF($C$4, 'Other Graphs'!$A$6*H97-EXP(-1*'Other Graphs'!$A$3*D97)*'Other Graphs'!$A$9*I97,-1*'Other Graphs'!$A$6*H97+EXP(-1*'Other Graphs'!$A$3*D97)*'Other Graphs'!$A$9*I97)","v":98.081508775124192},{"$f":"(LN('Other Graphs'!$A$6/'Other Graphs'!$A$9)+('Other Graphs'!$A$3+0.5*'Other Graphs'!$A$15^2)*D97)/('Other Graphs'!$A$15*SQRT(D97))","v":2.1123150985648422},{"$f":"F97-'Other Graphs'!$A$15*SQRT(D97)","v":0.57608593597222946},0.98267028416383517,0.71772145144067068,{"$f":"(F97*SQRT(D97)+SQRT(F97^2*D97-2*D97*LN('Other Graphs'!$A$6/'Other Graphs'!$A$9)-2*Data!D97^2*'Other Graphs'!$A$3))/D97","v":0.34999999999999981},{"$f":"(F97*SQRT(D97)-SQRT(F97^2*D97-2*D97*LN('Other Graphs'!$A$6/'Other Graphs'!$A$9)-2*Data!D97^2*'Other Graphs'!$A$3))/D97","v":0.20000000000000018},null,null,null,59.000000999999997,{"$f":"IF($C$4, 'Option vs Time'!$A$6*S97-EXP(-1*'Option vs Time'!$A$3*O97)*'Option vs Time'!$A$9*T97,-1*'Option vs Time'!$A$6*S97+EXP(-1*'Option vs Time'!$A$3*O97)*'Option vs Time'!$A$9*T97)","v":88.26847097926418},{"$f":"(LN('Option vs Time'!$A$6/'Option vs Time'!$A$9)+('Option vs Time'!$A$3+0.5*'Option vs Time'!$A$15^2)*O97)/('Option vs Time'!$A$15*SQRT(O97))","v":2.0502734565200611},{"$f":"Q97-'Option vs Time'!$A$15*SQRT(O97)","v":0.51404429392744833},0.97983112335062827,0.69638948854954452,0.39662175306611402]
[null,null,null,60.000000999999997,{"$f":"IF($C$4, 'Other Graphs'!$A$6*H98-EXP(-1*'Other Graphs'!$A$3*D98)*'Other Graphs'!$A$9*I98,-1*'Other Graphs'!$A$6*H98+EXP(-1*'Other Graphs'!$A$3*D98)*'Other Graphs'!$A$9*I98)","v":98.486244858363094},{"$f":"(LN('Other Graphs'!$A$6/'Other Graphs'!$A$9)+('Other Graphs'!$A$3+0.5*'Other Graphs'!$A$15^2)*D98)/('Other Graphs'!$A$15*SQRT(D98))","v":2.130140858165253},{"$f":"F98-'Other Graphs'!$A$15*SQRT(D98)","v":0.58094750677234175},0.98342000700311638,0.71936208356417897,{"$f":"(F98*SQRT(D98)+SQRT(F98^2*D98-2*D98*LN('Other Graphs'!$A$6/'Other Graphs'!$A$9)-2*Data!D98^2*'Other Graphs'!$A$3))/D98","v":0.35000000000000009},{"$f":"(F98*SQRT(D98)-SQRT(F98^2*D98-2*D98*LN('Other Graphs'!$A$6/'Other Graphs'!$A$9)-2*Data!D98^2*'Other Graphs'!$A$3))/D98","v":0.19999999999999998},null,null,null,60.000000999999997,{"$f":"IF($C$4, 'Option vs Time'!$A$6*S98-EXP(-1*'Option vs Time'!$A$3*O98)*'Option vs Time'!$A$9*T98,-1*'Option vs Time'!$A$6*S98+EXP(-1*'Option vs Time'!$A$3*O98)*'Option vs Time'!$A$9*T98)","v":88.665092732330294},{"$f":"(LN('Option vs Time'!$A$6/'Option vs Time'!$A$9)+('Option vs Time'!$A$3+0.5*'Option vs Time'!$A$15^2)*O98)/('Option vs Time'!$A$15*SQRT(O98))","v":2.0686184021602427},{"$f":"Q98-'Option vs Time'!$A$15*SQRT(O98)","v":0.51942505076733148},0.98070904514932555,0.6982678170062907,0.38318265669749962]
[null,null,null,61.000000999999997,{"$f":"IF($C$4, 'Other Graphs'!$A$6*H99-EXP(-1*'Other Graphs'!$A$3*D99)*'Other Graphs'!$A$9*I99,-1*'Other Graphs'!$A$6*H99+EXP(-1*'Other Graphs'!$A$3*D99)*'Other Graphs'!$A$9*I99)","v":98.877174137561269},{"$f":"(LN('Other Graphs'!$A$6/'Other Graphs'!$A$9)+('Other Graphs'!$A$3+0.5*'Other Graphs'!$A$15^2)*D99)/('Other Graphs'!$A$15*SQRT(D99))","v":2.1478186784794007},{"$f":"F99-'Other Graphs'!$A$15*SQRT(D99)","v":0.58576873049438172},0.98413591870459971,0.72098453017032382,{"$f":"(F99*SQRT(D99)+SQRT(F99^2*D99-2*D99*LN('Other Graphs'!$A$6/'Other Graphs'!$A$9)-2*Data!D99^2*'Other Graphs'!$A$3))/D99","v":0.34999999999999987},{"$f":"(F99*SQRT(D99)-SQRT(F99^2*D99-2*D99*LN('Other Graphs'!$A$6/'Other Graphs'!$A$9)-2*Data!D99^2*'Other Graphs'!$A$3))/D99","v":0.20000000000000015},null,null,null,61.000000999999997,{"$f":"IF($C$4, 'Option vs Time'!$A$6*S99-EXP(-1*'Option vs Time'!$A$3*O99)*'Option vs Time'!$A$9*T99,-1*'Option vs Time'!$A$6*S99+EXP(-1*'Option vs Time'!$A$3*O99)*'Option vs Time'!$A$9*T99)","v":89.048275389027793},{"$f":"(LN('Option vs Time'!$A$6/'Option vs Time'!$A$9)+('Option vs Time'!$A$3+0.5*'Option vs Time'!$A$15^2)*O99)/('Option vs Time'!$A$15*SQRT(O99))","v":2.0868025887395873},{"$f":"Q99-'Option vs Time'!$A$15*SQRT(O99)","v":0.5247526407545684},0.98154700847812104,0.70012242101525712,0.37020309709681953]
[null,null,null,62.000000999999997,{"$f":"IF($C$4, 'Other Graphs'!$A$6*H100-EXP(-1*'Other Graphs'!$A$3*D100)*'Other Graphs'!$A$9*I100,-1*'Other Graphs'!$A$6*H100+EXP(-1*'Other Graphs'!$A$3*D100)*'Other Graphs'!$A$9*I100)","v":99.254773877563949},{"$f":"(LN('Other Graphs'!$A$6/'Other Graphs'!$A$9)+('Other Graphs'!$A$3+0.5*'Other Graphs'!$A$15^2)*D100)/('Other Graphs'!$A$15*SQRT(D100))","v":2.1653521828157656},{"$f":"F100-'Other Graphs'!$A$15*SQRT(D100)","v":0.59055059531339071},0.98481963751267465,0.72258921207870308,{"$f":"(F100*SQRT(D100)+SQRT(F100^2*D100-2*D100*LN('Other Graphs'!$A$6/'Other Graphs'!$A$9)-2*Data!D100^2*'Other Graphs'!$A$3))/D100","v":0.3500000000000002},{"$f":"(F100*SQRT(D100)-SQRT(F100^2*D100-2*D100*LN('Other Graphs'!$A$6/'Other Graphs'!$A$9)-2*Data!D100^2*'Other Graphs'!$A$3))/D100","v":0.1999999999999999},null,null,null,62.000000999999997,{"$f":"IF($C$4, 'Option vs Time'!$A$6*S100-EXP(-1*'Option vs Time'!$A$3*O100)*'Option vs Time'!$A$9*T100,-1*'Option vs Time'!$A$6*S100+EXP(-1*'Option vs Time'!$A$3*O100)*'Option vs Time'!$A$9*T100)","v":89.418478486124613},{"$f":"(LN('Option vs Time'!$A$6/'Option vs Time'!$A$9)+('Option vs Time'!$A$3+0.5*'Option vs Time'!$A$15^2)*O100)/('Option vs Time'!$A$15*SQRT(O100))","v":2.1048301586060454},{"$f":"Q100-'Option vs Time'!$A$15*SQRT(O100)","v":0.53002857110367052},0.98234695253170123,0.70195393920953641,0.35766693039892061]
[null,null,null,63.000000999999997,{"$f":"IF($C$4, 'Other Graphs'!$A$6*H101-EXP(-1*'Other Graphs'!$A$3*D101)*'Other Graphs'!$A$9*I101,-1*'Other Graphs'!$A$6*H101+EXP(-1*'Other Graphs'!$A$3*D101)*'Other Graphs'!$A$9*I101)","v":99.619504266277076},{"$f":"(LN('Other Graphs'!$A$6/'Other Graphs'!$A$9)+('Other Graphs'!$A$3+0.5*'Other Graphs'!$A$15^2)*D101)/('Other Graphs'!$A$15*SQRT(D101))","v":2.1827448489516592},{"$f":"F101-'Other Graphs'!$A$15*SQRT(D101)","v":0.59529404971408906},0.98547269742261345,0.72417653367534207,{"$f":"(F101*SQRT(D101)+SQRT(F101^2*D101-2*D101*LN('Other Graphs'!$A$6/'Other Graphs'!$A$9)-2*Data!D101^2*'Other Graphs'!$A$3))/D101","v":0.3500000000000002},{"$f":"(F101*SQRT(D101)-SQRT(F101^2*D101-2*D101*LN('Other Graphs'!$A$6/'Other Graphs'!$A$9)-2*Data!D101^2*'Other Graphs'!$A$3))/D101","v":0.19999999999999996},null,null,null,63.000000999999997,{"$f":"IF($C$4, 'Option vs Time'!$A$6*S101-EXP(-1*'Option vs Time'!$A$3*O101)*'Option vs Time'!$A$9*T101,-1*'Option vs Time'!$A$6*S101+EXP(-1*'Option vs Time'!$A$3*O101)*'Option vs Time'!$A$9*T101)","v":89.776145416523534},{"$f":"(LN('Option vs Time'!$A$6/'Option vs Time'!$A$9)+('Option vs Time'!$A$3+0.5*'Option vs Time'!$A$15^2)*O101)/('Option vs Time'!$A$15*SQRT(O101))","v":2.1227050796245712},{"$f":"Q101-'Option vs Time'!$A$15*SQRT(O101)","v":0.53525428038700107},0.98311071345341783,0.70376298178990482,0.34555862189158404]
[null,null,null,64.000000999999997,{"$f":"IF($C$4, 'Other Graphs'!$A$6*H102-EXP(-1*'Other Graphs'!$A$3*D102)*'Other Graphs'!$A$9*I102,-1*'Other Graphs'!$A$6*H102+EXP(-1*'Other Graphs'!$A$3*D102)*'Other Graphs'!$A$9*I102)","v":99.971809079105512},{"$f":"(LN('Other Graphs'!$A$6/'Other Graphs'!$A$9)+('Other Graphs'!$A$3+0.5*'Other Graphs'!$A$15^2)*D102)/('Other Graphs'!$A$15*SQRT(D102))","v":2.2000000171875},{"$f":"F102-'Other Graphs'!$A$15*SQRT(D102)","v":0.60000000468750003},0.98609655309622091,0.72574688381191677,{"$f":"(F102*SQRT(D102)+SQRT(F102^2*D102-2*D102*LN('Other Graphs'!$A$6/'Other Graphs'!$A$9)-2*Data!D102^2*'Other Graphs'!$A$3))/D102","v":0.35000000000000009},{"$f":"(F102*SQRT(D102)-SQRT(F102^2*D102-2*D102*LN('Other Graphs'!$A$6/'Other Graphs'!$A$9)-2*Data!D102^2*'Other Graphs'!$A$3))/D102","v":0.20000000000000004},null,null,null,64.000000999999997,{"$f":"IF($C$4, 'Option vs Time'!$A$6*S102-EXP(-1*'Option vs Time'!$A$3*O102)*'Option vs Time'!$A$9*T102,-1*'Option vs Time'!$A$6*S102+EXP(-1*'Option vs Time'!$A$3*O102)*'Option vs Time'!$A$9*T102)","v":90.121704038415118},{"$f":"(LN('Option vs Time'!$A$6/'Option vs Time'!$A$9)+('Option vs Time'!$A$3+0.5*'Option vs Time'!$A$15^2)*O102)/('Option vs Time'!$A$15*SQRT(O102))","v":2.1404311552751785},{"$f":"Q102-'Option vs Time'!$A$15*SQRT(O102)","v":0.54043114277517845},0.98384003052243074,0.70555013226514307,0.33386321892631088]
[null,null,null,65.000000999999997,{"$f":"IF($C$4, 'Other Graphs'!$A$6*H103-EXP(-1*'Other Graphs'!$A$3*D103)*'Other Graphs'!$A$9*I103,-1*'Other Graphs'!$A$6*H103+EXP(-1*'Other Graphs'!$A$3*D103)*'Other Graphs'!$A$9*I103)","v":100.31211631250871},{"$f":"(LN('Other Graphs'!$A$6/'Other Graphs'!$A$9)+('Other Graphs'!$A$3+0.5*'Other Graphs'!$A$15^2)*D103)/('Other Graphs'!$A$15*SQRT(D103))","v":2.2171208978368773},{"$f":"F103-'Other Graphs'!$A$15*SQRT(D103)","v":0.60466933577369386},{"$f":"IF($C$4,NORMSDIST(F103),NORMSDIST(-1*F103))","v":0.98669258444681585},{"$f":"IF($C$4,NORMSDIST(G103),NORMSDIST(-1*G103))","v":0.72730063664235178},{"$f":"(F103*SQRT(D103)+SQRT(F103^2*D103-2*D103*LN('Other Graphs'!$A$6/'Other Graphs'!$A$9)-2*Data!D103^2*'Other Graphs'!$A$3))/D103","v":0.35000000000000014},{"$f":"(F103*SQRT(D103)-SQRT(F103^2*D103-2*D103*LN('Other Graphs'!$A$6/'Other Graphs'!$A$9)-2*Data!D103^2*'Other Graphs'!$A$3))/D103","v":0.19999999999999993},null,null,null,65.000000999999997,{"$f":"IF($C$4, 'Option vs Time'!$A$6*S103-EXP(-1*'Option vs Time'!$A$3*O103)*'Option vs Time'!$A$9*T103,-1*'Option vs Time'!$A$6*S103+EXP(-1*'Option vs Time'!$A$3*O103)*'Option vs Time'!$A$9*T103)","v":90.455567257341428},{"$f":"(LN('Option vs Time'!$A$6/'Option vs Time'!$A$9)+('Option vs Time'!$A$3+0.5*'Option vs Time'!$A$15^2)*O103)/('Option vs Time'!$A$15*SQRT(O103))","v":2.158012034013165},{"$f":"Q103-'Option vs Time'!$A$15*SQRT(O103)","v":0.54556047194998158},{"$f":"IF($C$4,NORMSDIST(Q103),NORMSDIST(-1*Q103))","v":0.9845365519092999},{"$f":"IF($C$4,NORMSDIST(R103),NORMSDIST(-1*R103))","v":0.7073159490586215},{"$f":"(P104-P103)/(O104-O103)","v":0.32256632543352737}]
[null,null,null,66.000000999999997,{"$f":"IF($C$4, 'Other Graphs'!$A$6*H104-EXP(-1*'Other Graphs'!$A$3*D104)*'Other Graphs'!$A$9*I104,-1*'Other Graphs'!$A$6*H104+EXP(-1*'Other Graphs'!$A$3*D104)*'Other Graphs'!$A$9*I104)","v":100.6408387885844},{"$f":"(LN('Other Graphs'!$A$6/'Other Graphs'!$A$9)+('Other Graphs'!$A$3+0.5*'Other Graphs'!$A$15^2)*D104)/('Other Graphs'!$A$15*SQRT(D104))","v":2.2341105781999695},{"$f":"F104-'Other Graphs'!$A$15*SQRT(D104)","v":0.60930288496362839},0.98726210091961752,0.72883815240205563,{"$f":"(F104*SQRT(D104)+SQRT(F104^2*D104-2*D104*LN('Other Graphs'!$A$6/'Other Graphs'!$A$9)-2*Data!D104^2*'Other Graphs'!$A$3))/D104","v":0.3500000000000002},{"$f":"(F104*SQRT(D104)-SQRT(F104^2*D104-2*D104*LN('Other Graphs'!$A$6/'Other Graphs'!$A$9)-2*Data!D104^2*'Other Graphs'!$A$3))/D104","v":0.19999999999999993},null,null,null,66.000000999999997,{"$f":"IF($C$4, 'Option vs Time'!$A$6*S104-EXP(-1*'Option vs Time'!$A$3*O104)*'Option vs Time'!$A$9*T104,-1*'Option vs Time'!$A$6*S104+EXP(-1*'Option vs Time'!$A$3*O104)*'Option vs Time'!$A$9*T104)","v":90.778133582774956},{"$f":"(LN('Option vs Time'!$A$6/'Option vs Time'!$A$9)+('Option vs Time'!$A$3+0.5*'Option vs Time'!$A$15^2)*O104)/('Option vs Time'!$A$15*SQRT(O104))","v":2.1754512179562453},{"$f":"Q104-'Option vs Time'!$A$15*SQRT(O104)","v":0.55064352471990419},0.98520184003547706,0.70906096699341847,0.31165407791114319]
[null,null,null,67.000000999999997,{"$f":"IF($C$4, 'Other Graphs'!$A$6*H105-EXP(-1*'Other Graphs'!$A$3*D105)*'Other Graphs'!$A$9*I105,-1*'Other Graphs'!$A$6*H105+EXP(-1*'Other Graphs'!$A$3*D105)*'Other Graphs'!$A$9*I105)","v":100.95837473243073},{"$f":"(LN('Other Graphs'!$A$6/'Other Graphs'!$A$9)+('Other Graphs'!$A$3+0.5*'Other Graphs'!$A$15^2)*D105)/('Other Graphs'!$A$15*SQRT(D105))","v":2.2509720290632225},{"$f":"F105-'Other Graphs'!$A$15*SQRT(D105)","v":0.61390146247178801},0.98780634549120561,0.73035977813453989,{"$f":"(F105*SQRT(D105)+SQRT(F105^2*D105-2*D105*LN('Other Graphs'!$A$6/'Other Graphs'!$A$9)-2*Data!D105^2*'Other Graphs'!$A$3))/D105","v":0.35000000000000014},{"$f":"(F105*SQRT(D105)-SQRT(F105^2*D105-2*D105*LN('Other Graphs'!$A$6/'Other Graphs'!$A$9)-2*Data!D105^2*'Other Graphs'!$A$3))/D105","v":0.19999999999999996},null,null,null,67.000000999999997,{"$f":"IF($C$4, 'Option vs Time'!$A$6*S105-EXP(-1*'Option vs Time'!$A$3*O105)*'Option vs Time'!$A$9*T105,-1*'Option vs Time'!$A$6*S105+EXP(-1*'Option vs Time'!$A$3*O105)*'Option vs Time'!$A$9*T105)","v":91.089787660686099},{"$f":"(LN('Option vs Time'!$A$6/'Option vs Time'!$A$9)+('Option vs Time'!$A$3+0.5*'Option vs Time'!$A$15^2)*O105)/('Option vs Time'!$A$15*SQRT(O105))","v":2.1927520709567299},{"$f":"Q105-'Option vs Time'!$A$15*SQRT(O105)","v":0.5556815043652954},0.98583737656873593,0.71078569866693864,0.30111312276724789]
[null,null,null,68.000000999999997,{"$f":"IF($C$4, 'Other Graphs'!$A$6*H106-EXP(-1*'Other Graphs'!$A$3*D106)*'Other Graphs'!$A$9*I106,-1*'Other Graphs'!$A$6*H106+EXP(-1*'Other Graphs'!$A$3*D106)*'Other Graphs'!$A$9*I106)","v":101.26510832389205},{"$f":"(LN('Other Graphs'!$A$6/'Other Graphs'!$A$9)+('Other Graphs'!$A$3+0.5*'Other Graphs'!$A$15^2)*D106)/('Other Graphs'!$A$15*SQRT(D106))","v":2.2677081107640378},{"$f":"F106-'Other Graphs'!$A$15*SQRT(D106)","v":0.61846584839019236},0.98832649840956677,0.73186584836970925,{"$f":"(F106*SQRT(D106)+SQRT(F106^2*D106-2*D106*LN('Other Graphs'!$A$6/'Other Graphs'!$A$9)-2*Data!D106^2*'Other Graphs'!$A$3))/D106","v":0.35000000000000014},{"$f":"(F106*SQRT(D106)-SQRT(F106^2*D106-2*D106*LN('Other Graphs'!$A$6/'Other Graphs'!$A$9)-2*Data!D106^2*'Other Graphs'!$A$3))/D106","v":0.1999999999999999},null,null,null,68.000000999999997,{"$f":"IF($C$4, 'Option vs Time'!$A$6*S106-EXP(-1*'Option vs Time'!$A$3*O106)*'Option vs Time'!$A$9*T106,-1*'Option vs Time'!$A$6*S106+EXP(-1*'Option vs Time'!$A$3*O106)*'Option vs Time'!$A$9*T106)","v":91.390900783453347},{"$f":"(LN('Option vs Time'!$A$6/'Option vs Time'!$A$9)+('Option vs Time'!$A$3+0.5*'Option vs Time'!$A$15^2)*O106)/('Option vs Time'!$A$15*SQRT(O106))","v":2.2099178261110484},{"$f":"Q106-'Option vs Time'!$A$15*SQRT(O106)","v":0.56067556373720295},0.98644456708354011,0.7124906357248515,0.29093059491211193]
[null,null,null,69.000000999999997,{"$f":"IF($C$4, 'Other Graphs'!$A$6*H107-EXP(-1*'Other Graphs'!$A$3*D107)*'Other Graphs'!$A$9*I107,-1*'Other Graphs'!$A$6*H107+EXP(-1*'Other Graphs'!$A$3*D107)*'Other Graphs'!$A$9*I107)","v":101.56141022516614},{"$f":"(LN('Other Graphs'!$A$6/'Other Graphs'!$A$9)+('Other Graphs'!$A$3+0.5*'Other Graphs'!$A$15^2)*D107)/('Other Graphs'!$A$15*SQRT(D107))","v":2.2843215788555256},{"$f":"F107-'Other Graphs'!$A$15*SQRT(D107)","v":0.62299679423332521},0.98882368069431781,0.73335668575770185,{"$f":"(F107*SQRT(D107)+SQRT(F107^2*D107-2*D107*LN('Other Graphs'!$A$6/'Other Graphs'!$A$9)-2*Data!D107^2*'Other Graphs'!$A$3))/D107","v":0.3500000000000002},{"$f":"(F107*SQRT(D107)-SQRT(F107^2*D107-2*D107*LN('Other Graphs'!$A$6/'Other Graphs'!$A$9)-2*Data!D107^2*'Other Graphs'!$A$3))/D107","v":0.19999999999999987},null,null,null,69.000000999999997,{"$f":"IF($C$4, 'Option vs Time'!$A$6*S107-EXP(-1*'Option vs Time'!$A$3*O107)*'Option vs Time'!$A$9*T107,-1*'Option vs Time'!$A$6*S107+EXP(-1*'Option vs Time'!$A$3*O107)*'Option vs Time'!$A$9*T107)","v":91.681831378365459},{"$f":"(LN('Option vs Time'!$A$6/'Option vs Time'!$A$9)+('Option vs Time'!$A$3+0.5*'Option vs Time'!$A$15^2)*O107)/('Option vs Time'!$A$15*SQRT(O107))","v":2.2269515927537418},{"$f":"Q107-'Option vs Time'!$A$15*SQRT(O107)","v":0.56562680813154143},0.98702474541265062,0.71417625004315999,0.28109409750352654]
[null,null,null,70.000000999999997,{"$f":"IF($C$4, 'Other Graphs'!$A$6*H108-EXP(-1*'Other Graphs'!$A$3*D108)*'Other Graphs'!$A$9*I108,-1*'Other Graphs'!$A$6*H108+EXP(-1*'Other Graphs'!$A$3*D108)*'Other Graphs'!$A$9*I108)","v":101.84763808563383},{"$f":"(LN('Other Graphs'!$A$6/'Other Graphs'!$A$9)+('Other Graphs'!$A$3+0.5*'Other Graphs'!$A$15^2)*D108)/('Other Graphs'!$A$15*SQRT(D108))","v":2.300815089403101},{"$f":"F108-'Other Graphs'!$A$15*SQRT(D108)","v":0.6274950243826638},0.98929895741497065,0.73483260166180031,{"$f":"(F108*SQRT(D108)+SQRT(F108^2*D108-2*D108*LN('Other Graphs'!$A$6/'Other Graphs'!$A$9)-2*Data!D108^2*'Other Graphs'!$A$3))/D108","v":0.34999999999999992},{"$f":"(F108*SQRT(D108)-SQRT(F108^2*D108-2*D108*LN('Other Graphs'!$A$6/'Other Graphs'!$A$9)-2*Data!D108^2*'Other Graphs'!$A$3))/D108","v":0.20000000000000004},null,null,null,70.000000999999997,{"$f":"IF($C$4, 'Option vs Time'!$A$6*S108-EXP(-1*'Option vs Time'!$A$3*O108)*'Option vs Time'!$A$9*T108,-1*'Option vs Time'!$A$6*S108+EXP(-1*'Option vs Time'!$A$3*O108)*'Option vs Time'!$A$9*T108)","v":91.962925475868985},{"$f":"(LN('Option vs Time'!$A$6/'Option vs Time'!$A$9)+('Option vs Time'!$A$3+0.5*'Option vs Time'!$A$15^2)*O108)/('Option vs Time'!$A$15*SQRT(O108))","v":2.243856362978482},{"$f":"Q108-'Option vs Time'!$A$15*SQRT(O108)","v":0.57053629795804484},0.98757917771385773,0.71584299482632519,0.2715916827602598]
[null,null,null,71.000000999999997,{"$f":"IF($C$4, 'Other Graphs'!$A$6*H109-EXP(-1*'Other Graphs'!$A$3*D109)*'Other Graphs'!$A$9*I109,-1*'Other Graphs'!$A$6*H109+EXP(-1*'Other Graphs'!$A$3*D109)*'Other Graphs'!$A$9*I109)","v":102.12413702516841},{"$f":"(LN('Other Graphs'!$A$6/'Other Graphs'!$A$9)+('Other Graphs'!$A$3+0.5*'Other Graphs'!$A$15^2)*D109)/('Other Graphs'!$A$15*SQRT(D109))","v":2.3171912039417464},{"$f":"F109-'Other Graphs'!$A$15*SQRT(D109)","v":0.63196123743865784},0.98975334076354915,0.73629389671360246,{"$f":"(F109*SQRT(D109)+SQRT(F109^2*D109-2*D109*LN('Other Graphs'!$A$6/'Other Graphs'!$A$9)-2*Data!D109^2*'Other Graphs'!$A$3))/D109","v":0.35},{"$f":"(F109*SQRT(D109)-SQRT(F109^2*D109-2*D109*LN('Other Graphs'!$A$6/'Other Graphs'!$A$9)-2*Data!D109^2*'Other Graphs'!$A$3))/D109","v":0.20000000000000004},null,null,null,71.000000999999997,{"$f":"IF($C$4, 'Option vs Time'!$A$6*S109-EXP(-1*'Option vs Time'!$A$3*O109)*'Option vs Time'!$A$9*T109,-1*'Option vs Time'!$A$6*S109+EXP(-1*'Option vs Time'!$A$3*O109)*'Option vs Time'!$A$9*T109)","v":92.234517158629245},{"$f":"(LN('Option vs Time'!$A$6/'Option vs Time'!$A$9)+('Option vs Time'!$A$3+0.5*'Option vs Time'!$A$15^2)*O109)/('Option vs Time'!$A$15*SQRT(O109))","v":2.2606350177245638},{"$f":"Q109-'Option vs Time'!$A$15*SQRT(O109)","v":0.57540505122147523},0.98810906627356521,0.71749130562857144,0.26241183376630772]
[null,null,null,72.000000999999997,{"$f":"IF($C$4, 'Other Graphs'!$A$6*H110-EXP(-1*'Other Graphs'!$A$3*D110)*'Other Graphs'!$A$9*I110,-1*'Other Graphs'!$A$6*H110+EXP(-1*'Other Graphs'!$A$3*D110)*'Other Graphs'!$A$9*I110)","v":102.39124009708817},{"$f":"(LN('Other Graphs'!$A$6/'Other Graphs'!$A$9)+('Other Graphs'!$A$3+0.5*'Other Graphs'!$A$15^2)*D110)/('Other Graphs'!$A$15*SQRT(D110))","v":2.3334523941201377},{"$f":"F110-'Other Graphs'!$A$15*SQRT(D110)","v":0.63639610748731079},0.99018779293647552,0.73774086133335581,{"$f":"(F110*SQRT(D110)+SQRT(F110^2*D110-2*D110*LN('Other Graphs'!$A$6/'Other Graphs'!$A$9)-2*Data!D110^2*'Other Graphs'!$A$3))/D110","v":0.35000000000000026},{"$f":"(F110*SQRT(D110)-SQRT(F110^2*D110-2*D110*LN('Other Graphs'!$A$6/'Other Graphs'!$A$9)-2*Data!D110^2*'Other Graphs'!$A$3))/D110","v":0.19999999999999984},null,null,null,72.000000999999997,{"$f":"IF($C$4, 'Option vs Time'!$A$6*S110-EXP(-1*'Option vs Time'!$A$3*O110)*'Option vs Time'!$A$9*T110,-1*'Option vs Time'!$A$6*S110+EXP(-1*'Option vs Time'!$A$3*O110)*'Option vs Time'!$A$9*T110)","v":92.496928992395553},{"$f":"(LN('Option vs Time'!$A$6/'Option vs Time'!$A$9)+('Option vs Time'!$A$3+0.5*'Option vs Time'!$A$15^2)*O110)/('Option vs Time'!$A$15*SQRT(O110))","v":2.2772903324636959},{"$f":"Q110-'Option vs Time'!$A$15*SQRT(O110)","v":0.58023404583086902},0.98861555306702265,0.71912160130480318,0.25354344719525557]
[null,null,null,73.000000999999997,{"$f":"IF($C$4, 'Other Graphs'!$A$6*H111-EXP(-1*'Other Graphs'!$A$3*D111)*'Other Graphs'!$A$9*I111,-1*'Other Graphs'!$A$6*H111+EXP(-1*'Other Graphs'!$A$3*D111)*'Other Graphs'!$A$9*I111)","v":102.64926873183025},{"$f":"(LN('Other Graphs'!$A$6/'Other Graphs'!$A$9)+('Other Graphs'!$A$3+0.5*'Other Graphs'!$A$15^2)*D111)/('Other Graphs'!$A$15*SQRT(D111))","v":2.3496010460554793},{"$f":"F111-'Other Graphs'!$A$15*SQRT(D111)","v":0.64080028528785848},0.99060322883938445,0.73917377621809655,{"$f":"(F111*SQRT(D111)+SQRT(F111^2*D111-2*D111*LN('Other Graphs'!$A$6/'Other Graphs'!$A$9)-2*Data!D111^2*'Other Graphs'!$A$3))/D111","v":0.3500000000000002},{"$f":"(F111*SQRT(D111)-SQRT(F111^2*D111-2*D111*LN('Other Graphs'!$A$6/'Other Graphs'!$A$9)-2*Data!D111^2*'Other Graphs'!$A$3))/D111","v":0.19999999999999982},null,null,null,73.000000999999997,{"$f":"IF($C$4, 'Option vs Time'!$A$6*S111-EXP(-1*'Option vs Time'!$A$3*O111)*'Option vs Time'!$A$9*T111,-1*'Option vs Time'!$A$6*S111+EXP(-1*'Option vs Time'!$A$3*O111)*'Option vs Time'!$A$9*T111)","v":92.750472439590808},{"$f":"(LN('Option vs Time'!$A$6/'Option vs Time'!$A$9)+('Option vs Time'!$A$3+0.5*'Option vs Time'!$A$15^2)*O111)/('Option vs Time'!$A$15*SQRT(O111))","v":2.293824982518669},{"$f":"Q111-'Option vs Time'!$A$15*SQRT(O111)","v":0.58502422175104818},0.98909972309326477,0.72073428489693969,0.24497581689234948]
[null,null,null,74.000000999999997,{"$f":"IF($C$4, 'Other Graphs'!$A$6*H112-EXP(-1*'Other Graphs'!$A$3*D112)*'Other Graphs'!$A$9*I112,-1*'Other Graphs'!$A$6*H112+EXP(-1*'Other Graphs'!$A$3*D112)*'Other Graphs'!$A$9*I112)","v":102.89853316234776},{"$f":"(LN('Other Graphs'!$A$6/'Other Graphs'!$A$9)+('Other Graphs'!$A$3+0.5*'Other Graphs'!$A$15^2)*D112)/('Other Graphs'!$A$15*SQRT(D112))","v":2.3656394644207728},{"$f":"F112-'Other Graphs'!$A$15*SQRT(D112)","v":0.64517439938748367},0.99100051862738725,0.7405929128000025,{"$f":"(F112*SQRT(D112)+SQRT(F112^2*D112-2*D112*LN('Other Graphs'!$A$6/'Other Graphs'!$A$9)-2*Data!D112^2*'Other Graphs'!$A$3))/D112","v":0.35},{"$f":"(F112*SQRT(D112)-SQRT(F112^2*D112-2*D112*LN('Other Graphs'!$A$6/'Other Graphs'!$A$9)-2*Data!D112^2*'Other Graphs'!$A$3))/D112","v":0.2},null,null,null,74.000000999999997,{"$f":"IF($C$4, 'Option vs Time'!$A$6*S112-EXP(-1*'Option vs Time'!$A$3*O112)*'Option vs Time'!$A$9*T112,-1*'Option vs Time'!$A$6*S112+EXP(-1*'Option vs Time'!$A$3*O112)*'Option vs Time'!$A$9*T112)","v":92.995448256483158},{"$f":"(LN('Option vs Time'!$A$6/'Option vs Time'!$A$9)+('Option vs Time'!$A$3+0.5*'Option vs Time'!$A$15^2)*O112)/('Option vs Time'!$A$15*SQRT(O112))","v":2.3102415480425753},{"$f":"Q112-'Option vs Time'!$A$15*SQRT(O112)","v":0.5897764830092862},0.98956260750125768,0.72232974446092113,0.23669861825561611]
[null,null,null,75.000000999999997,{"$f":"IF($C$4, 'Other Graphs'!$A$6*H113-EXP(-1*'Other Graphs'!$A$3*D113)*'Other Graphs'!$A$9*I113,-1*'Other Graphs'!$A$6*H113+EXP(-1*'Other Graphs'!$A$3*D113)*'Other Graphs'!$A$9*I113)","v":103.1393328321615},{"$f":"(LN('Other Graphs'!$A$6/'Other Graphs'!$A$9)+('Other Graphs'!$A$3+0.5*'Other Graphs'!$A$15^2)*D113)/('Other Graphs'!$A$15*SQRT(D113))","v":2.3815698762843387},{"$f":"F113-'Other Graphs'!$A$15*SQRT(D113)","v":0.64951905716845593},0.99138049009228268,0.74199853367715529,{"$f":"(F113*SQRT(D113)+SQRT(F113^2*D113-2*D113*LN('Other Graphs'!$A$6/'Other Graphs'!$A$9)-2*Data!D113^2*'Other Graphs'!$A$3))/D113","v":0.35000000000000003},{"$f":"(F113*SQRT(D113)-SQRT(F113^2*D113-2*D113*LN('Other Graphs'!$A$6/'Other Graphs'!$A$9)-2*Data!D113^2*'Other Graphs'!$A$3))/D113","v":0.20000000000000004},null,null,null,75.000000999999997,{"$f":"IF($C$4, 'Option vs Time'!$A$6*S113-EXP(-1*'Option vs Time'!$A$3*O113)*'Option vs Time'!$A$9*T113,-1*'Option vs Time'!$A$6*S113+EXP(-1*'Option vs Time'!$A$3*O113)*'Option vs Time'!$A$9*T113)","v":93.232146874738774},{"$f":"(LN('Option vs Time'!$A$6/'Option vs Time'!$A$9)+('Option vs Time'!$A$3+0.5*'Option vs Time'!$A$15^2)*O113)/('Option vs Time'!$A$15*SQRT(O113))","v":2.3265425186846489},{"$f":"Q113-'Option vs Time'!$A$15*SQRT(O113)","v":0.59449169956876613},0.99000518652234692,0.72390835383913821,0.22870189336413205]
[null,null,null,76.000000999999997,{"$f":"IF($C$4, 'Other Graphs'!$A$6*H114-EXP(-1*'Other Graphs'!$A$3*D114)*'Other Graphs'!$A$9*I114,-1*'Other Graphs'!$A$6*H114+EXP(-1*'Other Graphs'!$A$3*D114)*'Other Graphs'!$A$9*I114)","v":103.37195678693494},{"$f":"(LN('Other Graphs'!$A$6/'Other Graphs'!$A$9)+('Other Graphs'!$A$3+0.5*'Other Graphs'!$A$15^2)*D114)/('Other Graphs'!$A$15*SQRT(D114))","v":2.3973944347197023},{"$f":"F114-'Other Graphs'!$A$15*SQRT(D114)","v":0.65383484583264595},0.99174393090727897,0.74339089301872052,{"$f":"(F114*SQRT(D114)+SQRT(F114^2*D114-2*D114*LN('Other Graphs'!$A$6/'Other Graphs'!$A$9)-2*Data!D114^2*'Other Graphs'!$A$3))/D114","v":0.35000000000000014},{"$f":"(F114*SQRT(D114)-SQRT(F114^2*D114-2*D114*LN('Other Graphs'!$A$6/'Other Graphs'!$A$9)-2*Data!D114^2*'Other Graphs'!$A$3))/D114","v":0.19999999999999998},null,null,null,76.000000999999997,{"$f":"IF($C$4, 'Option vs Time'!$A$6*S114-EXP(-1*'Option vs Time'!$A$3*O114)*'Option vs Time'!$A$9*T114,-1*'Option vs Time'!$A$6*S114+EXP(-1*'Option vs Time'!$A$3*O114)*'Option vs Time'!$A$9*T114)","v":93.460848768102906},{"$f":"(LN('Option vs Time'!$A$6/'Option vs Time'!$A$9)+('Option vs Time'!$A$3+0.5*'Option vs Time'!$A$15^2)*O114)/('Option vs Time'!$A$15*SQRT(O114))","v":2.3427302979664737},{"$f":"Q114-'Option vs Time'!$A$15*SQRT(O114)","v":0.59917070907941739},0.99042839222283563,0.7254704733826054,0.22097603680522582]
[null,null,null,77.000000999999997,{"$f":"IF($C$4, 'Other Graphs'!$A$6*H115-EXP(-1*'Other Graphs'!$A$3*D115)*'Other Graphs'!$A$9*I115,-1*'Other Graphs'!$A$6*H115+EXP(-1*'Other Graphs'!$A$3*D115)*'Other Graphs'!$A$9*I115)","v":103.59668405038289},{"$f":"(LN('Other Graphs'!$A$6/'Other Graphs'!$A$9)+('Other Graphs'!$A$3+0.5*'Other Graphs'!$A$15^2)*D115)/('Other Graphs'!$A$15*SQRT(D115))","v":2.4131152222024128},{"$f":"F115-'Other Graphs'!$A$15*SQRT(D115)","v":0.65812233332793069},0.99209159073895059,0.74477023694638511,{"$f":"(F115*SQRT(D115)+SQRT(F115^2*D115-2*D115*LN('Other Graphs'!$A$6/'Other Graphs'!$A$9)-2*Data!D115^2*'Other Graphs'!$A$3))/D115","v":0.35000000000000003},{"$f":"(F115*SQRT(D115)-SQRT(F115^2*D115-2*D115*LN('Other Graphs'!$A$6/'Other Graphs'!$A$9)-2*Data!D115^2*'Other Graphs'!$A$3))/D115","v":0.19999999999999998},null,null,null,77.000000999999997,{"$f":"IF($C$4, 'Option vs Time'!$A$6*S115-EXP(-1*'Option vs Time'!$A$3*O115)*'Option vs Time'!$A$9*T115,-1*'Option vs Time'!$A$6*S115+EXP(-1*'Option vs Time'!$A$3*O115)*'Option vs Time'!$A$9*T115)","v":93.681824804908132},{"$f":"(LN('Option vs Time'!$A$6/'Option vs Time'!$A$9)+('Option vs Time'!$A$3+0.5*'Option vs Time'!$A$15^2)*O115)/('Option vs Time'!$A$15*SQRT(O115))","v":2.3588072073901993},{"$f":"Q115-'Option vs Time'!$A$15*SQRT(O115)","v":0.60381431851571721},0.99083311108937511,0.72701645062679099,0.21351178215701339]
[null,null,null,78.000000999999997,{"$f":"IF($C$4, 'Other Graphs'!$A$6*H116-EXP(-1*'Other Graphs'!$A$3*D116)*'Other Graphs'!$A$9*I116,-1*'Other Graphs'!$A$6*H116+EXP(-1*'Other Graphs'!$A$3*D116)*'Other Graphs'!$A$9*I116)","v":103.81378398527147},{"$f":"(LN('Other Graphs'!$A$6/'Other Graphs'!$A$9)+('Other Graphs'!$A$3+0.5*'Other Graphs'!$A$15^2)*D116)/('Other Graphs'!$A$15*SQRT(D116))","v":2.4287342538089667},{"$f":"F116-'Other Graphs'!$A$15*SQRT(D116)","v":0.66238206922062681},0.99242418323538539,0.74613680389373305,{"$f":"(F116*SQRT(D116)+SQRT(F116^2*D116-2*D116*LN('Other Graphs'!$A$6/'Other Graphs'!$A$9)-2*Data!D116^2*'Other Graphs'!$A$3))/D116","v":0.3499999999999997},{"$f":"(F116*SQRT(D116)-SQRT(F116^2*D116-2*D116*LN('Other Graphs'!$A$6/'Other Graphs'!$A$9)-2*Data!D116^2*'Other Graphs'!$A$3))/D116","v":0.20000000000000021},null,null,null,78.000000999999997,{"$f":"IF($C$4, 'Option vs Time'!$A$6*S116-EXP(-1*'Option vs Time'!$A$3*O116)*'Option vs Time'!$A$9*T116,-1*'Option vs Time'!$A$6*S116+EXP(-1*'Option vs Time'!$A$3*O116)*'Option vs Time'!$A$9*T116)","v":93.895336587065145},{"$f":"(LN('Option vs Time'!$A$6/'Option vs Time'!$A$9)+('Option vs Time'!$A$3+0.5*'Option vs Time'!$A$15^2)*O116)/('Option vs Time'!$A$15*SQRT(O116))","v":2.3747754902985418},{"$f":"Q116-'Option vs Time'!$A$15*SQRT(O116)","v":0.60842330571020198},0.99122018645881682,0.72854662092467681,0.20630018908580894]
[null,null,null,79.000000999999997,{"$f":"IF($C$4, 'Other Graphs'!$A$6*H117-EXP(-1*'Other Graphs'!$A$3*D117)*'Other Graphs'!$A$9*I117,-1*'Other Graphs'!$A$6*H117+EXP(-1*'Other Graphs'!$A$3*D117)*'Other Graphs'!$A$9*I117)","v":104.02351664021921},{"$f":"(LN('Other Graphs'!$A$6/'Other Graphs'!$A$9)+('Other Graphs'!$A$3+0.5*'Other Graphs'!$A$15^2)*D117)/('Other Graphs'!$A$15*SQRT(D117))","v":2.4442534802317462},{"$f":"F117-'Other Graphs'!$A$15*SQRT(D117)","v":0.66661458551774944},0.99274238789878277,0.74749082494510588,{"$f":"(F117*SQRT(D117)+SQRT(F117^2*D117-2*D117*LN('Other Graphs'!$A$6/'Other Graphs'!$A$9)-2*Data!D117^2*'Other Graphs'!$A$3))/D117","v":0.35000000000000037},{"$f":"(F117*SQRT(D117)-SQRT(F117^2*D117-2*D117*LN('Other Graphs'!$A$6/'Other Graphs'!$A$9)-2*Data!D117^2*'Other Graphs'!$A$3))/D117","v":0.19999999999999984},null,null,null,79.000000999999997,{"$f":"IF($C$4, 'Option vs Time'!$A$6*S117-EXP(-1*'Option vs Time'!$A$3*O117)*'Option vs Time'!$A$9*T117,-1*'Option vs Time'!$A$6*S117+EXP(-1*'Option vs Time'!$A$3*O117)*'Option vs Time'!$A$9*T117)","v":94.101636776150954},{"$f":"(LN('Option vs Time'!$A$6/'Option vs Time'!$A$9)+('Option vs Time'!$A$3+0.5*'Option vs Time'!$A$15^2)*O117)/('Option vs Time'!$A$15*SQRT(O117))","v":2.3906373155046241},{"$f":"Q117-'Option vs Time'!$A$15*SQRT(O117)","v":0.61299842079062739},0.99159042080323345,0.73006130804028868,0.19933263102210219]
[null,null,null,80.000000999999997,{"$f":"IF($C$4, 'Other Graphs'!$A$6*H118-EXP(-1*'Other Graphs'!$A$3*D118)*'Other Graphs'!$A$9*I118,-1*'Other Graphs'!$A$6*H118+EXP(-1*'Other Graphs'!$A$3*D118)*'Other Graphs'!$A$9*I118)","v":104.22613308296424},{"$f":"(LN('Other Graphs'!$A$6/'Other Graphs'!$A$9)+('Other Graphs'!$A$3+0.5*'Other Graphs'!$A$15^2)*D118)/('Other Graphs'!$A$15*SQRT(D118))","v":2.4596747906227363},{"$f":"F118-'Other Graphs'!$A$15*SQRT(D118)","v":0.67082039744256461},0.99304685185012853,0.74883252415536039,{"$f":"(F118*SQRT(D118)+SQRT(F118^2*D118-2*D118*LN('Other Graphs'!$A$6/'Other Graphs'!$A$9)-2*Data!D118^2*'Other Graphs'!$A$3))/D118","v":0.3500000000000002},{"$f":"(F118*SQRT(D118)-SQRT(F118^2*D118-2*D118*LN('Other Graphs'!$A$6/'Other Graphs'!$A$9)-2*Data!D118^2*'Other Graphs'!$A$3))/D118","v":0.19999999999999996},null,null,null,80.000000999999997,{"$f":"IF($C$4, 'Option vs Time'!$A$6*S118-EXP(-1*'Option vs Time'!$A$3*O118)*'Option vs Time'!$A$9*T118,-1*'Option vs Time'!$A$6*S118+EXP(-1*'Option vs Time'!$A$3*O118)*'Option vs Time'!$A$9*T118)","v":94.300969407173056},{"$f":"(LN('Option vs Time'!$A$6/'Option vs Time'!$A$9)+('Option vs Time'!$A$3+0.5*'Option vs Time'!$A$15^2)*O118)/('Option vs Time'!$A$15*SQRT(O118))","v":2.4063947807081867},{"$f":"Q118-'Option vs Time'!$A$15*SQRT(O118)","v":0.61754038752801499},0.99194457787996737,0.73156082470565731,0.19260078338051301]
[null,null,null,81.000000999999997,{"$f":"IF($C$4, 'Other Graphs'!$A$6*H119-EXP(-1*'Other Graphs'!$A$3*D119)*'Other Graphs'!$A$9*I119,-1*'Other Graphs'!$A$6*H119+EXP(-1*'Other Graphs'!$A$3*D119)*'Other Graphs'!$A$9*I119)","v":104.42187572072227},{"$f":"(LN('Other Graphs'!$A$6/'Other Graphs'!$A$9)+('Other Graphs'!$A$3+0.5*'Other Graphs'!$A$15^2)*D119)/('Other Graphs'!$A$15*SQRT(D119))","v":2.4750000152777778},{"$f":"F119-'Other Graphs'!$A$15*SQRT(D119)","v":0.67500000416666683},0.99333819149299285,0.75016211885183637,{"$f":"(F119*SQRT(D119)+SQRT(F119^2*D119-2*D119*LN('Other Graphs'!$A$6/'Other Graphs'!$A$9)-2*Data!D119^2*'Other Graphs'!$A$3))/D119","v":0.35000000000000003},{"$f":"(F119*SQRT(D119)-SQRT(F119^2*D119-2*D119*LN('Other Graphs'!$A$6/'Other Graphs'!$A$9)-2*Data!D119^2*'Other Graphs'!$A$3))/D119","v":0.19999999999999998},null,null,null,81.000000999999997,{"$f":"IF($C$4, 'Option vs Time'!$A$6*S119-EXP(-1*'Option vs Time'!$A$3*O119)*'Option vs Time'!$A$9*T119,-1*'Option vs Time'!$A$6*S119+EXP(-1*'Option vs Time'!$A$3*O119)*'Option vs Time'!$A$9*T119)","v":94.493570190553569},{"$f":"(LN('Option vs Time'!$A$6/'Option vs Time'!$A$9)+('Option vs Time'!$A$3+0.5*'Option vs Time'!$A$15^2)*O119)/('Option vs Time'!$A$15*SQRT(O119))","v":2.4220499157133388},{"$f":"Q119-'Option vs Time'!$A$15*SQRT(O119)","v":0.62204990460222787},0.99228338475579181,0.73304547314392277,0.18609661229339736]
[null,null,null,82.000000999999997,{"$f":"IF($C$4, 'Other Graphs'!$A$6*H120-EXP(-1*'Other Graphs'!$A$3*D120)*'Other Graphs'!$A$9*I120,-1*'Other Graphs'!$A$6*H120+EXP(-1*'Other Graphs'!$A$3*D120)*'Other Graphs'!$A$9*I120)","v":104.61097860822304},{"$f":"(LN('Other Graphs'!$A$6/'Other Graphs'!$A$9)+('Other Graphs'!$A$3+0.5*'Other Graphs'!$A$15^2)*D120)/('Other Graphs'!$A$15*SQRT(D120))","v":2.4902309281721244},{"$f":"F120-'Other Graphs'!$A$15*SQRT(D120)","v":0.67915388950148836},0.99361699408297277,0.75147981991972168,{"$f":"(F120*SQRT(D120)+SQRT(F120^2*D120-2*D120*LN('Other Graphs'!$A$6/'Other Graphs'!$A$9)-2*Data!D120^2*'Other Graphs'!$A$3))/D120","v":0.35},{"$f":"(F120*SQRT(D120)-SQRT(F120^2*D120-2*D120*LN('Other Graphs'!$A$6/'Other Graphs'!$A$9)-2*Data!D120^2*'Other Graphs'!$A$3))/D120","v":0.20000000000000009},null,null,null,82.000000999999997,{"$f":"IF($C$4, 'Option vs Time'!$A$6*S120-EXP(-1*'Option vs Time'!$A$3*O120)*'Option vs Time'!$A$9*T120,-1*'Option vs Time'!$A$6*S120+EXP(-1*'Option vs Time'!$A$3*O120)*'Option vs Time'!$A$9*T120)","v":94.679666802846967},{"$f":"(LN('Option vs Time'!$A$6/'Option vs Time'!$A$9)+('Option vs Time'!$A$3+0.5*'Option vs Time'!$A$15^2)*O120)/('Option vs Time'!$A$15*SQRT(O120))","v":2.4376046854617184},{"$f":"Q120-'Option vs Time'!$A$15*SQRT(O120)","v":0.6265276467910823},0.99260753371356314,0.73451554556104026,0.17981236382819077]
[null,null,null,83.000000999999997,{"$f":"IF($C$4, 'Other Graphs'!$A$6*H121-EXP(-1*'Other Graphs'!$A$3*D121)*'Other Graphs'!$A$9*I121,-1*'Other Graphs'!$A$6*H121+EXP(-1*'Other Graphs'!$A$3*D121)*'Other Graphs'!$A$9*I121)","v":104.79366774397761},{"$f":"(LN('Other Graphs'!$A$6/'Other Graphs'!$A$9)+('Other Graphs'!$A$3+0.5*'Other Graphs'!$A$15^2)*D121)/('Other Graphs'!$A$15*SQRT(D121))","v":2.5053692493572681},{"$f":"F121-'Other Graphs'!$A$15*SQRT(D121)","v":0.6832825225519823},0.99388381920881352,0.75278583207192917,{"$f":"(F121*SQRT(D121)+SQRT(F121^2*D121-2*D121*LN('Other Graphs'!$A$6/'Other Graphs'!$A$9)-2*Data!D121^2*'Other Graphs'!$A$3))/D121","v":0.35000000000000009},{"$f":"(F121*SQRT(D121)-SQRT(F121^2*D121-2*D121*LN('Other Graphs'!$A$6/'Other Graphs'!$A$9)-2*Data!D121^2*'Other Graphs'!$A$3))/D121","v":0.19999999999999993},null,null,null,83.000000999999997,{"$f":"IF($C$4, 'Option vs Time'!$A$6*S121-EXP(-1*'Option vs Time'!$A$3*O121)*'Option vs Time'!$A$9*T121,-1*'Option vs Time'!$A$6*S121+EXP(-1*'Option vs Time'!$A$3*O121)*'Option vs Time'!$A$9*T121)","v":94.859479166675158},{"$f":"(LN('Option vs Time'!$A$6/'Option vs Time'!$A$9)+('Option vs Time'!$A$3+0.5*'Option vs Time'!$A$15^2)*O121)/('Option vs Time'!$A$15*SQRT(O121))","v":2.4530609928938478},{"$f":"Q121-'Option vs Time'!$A$15*SQRT(O121)","v":0.630974266088562},0.99291768404910341,0.73597132460836168,0.17374055366312291]
[null,null,null,84.000000999999997,{"$f":"IF($C$4, 'Other Graphs'!$A$6*H122-EXP(-1*'Other Graphs'!$A$3*D122)*'Other Graphs'!$A$9*I122,-1*'Other Graphs'!$A$6*H122+EXP(-1*'Other Graphs'!$A$3*D122)*'Other Graphs'!$A$9*I122)","v":104.97016135529807},{"$f":"(LN('Other Graphs'!$A$6/'Other Graphs'!$A$9)+('Other Graphs'!$A$3+0.5*'Other Graphs'!$A$15^2)*D122)/('Other Graphs'!$A$15*SQRT(D122))","v":2.5204166472281919},{"$f":"F122-'Other Graphs'!$A$15*SQRT(D122)","v":0.68738635833496131},0.99413920019080571,0.75408035410449736,{"$f":"(F122*SQRT(D122)+SQRT(F122^2*D122-2*D122*LN('Other Graphs'!$A$6/'Other Graphs'!$A$9)-2*Data!D122^2*'Other Graphs'!$A$3))/D122","v":0.35},{"$f":"(F122*SQRT(D122)-SQRT(F122^2*D122-2*D122*LN('Other Graphs'!$A$6/'Other Graphs'!$A$9)-2*Data!D122^2*'Other Graphs'!$A$3))/D122","v":0.20000000000000004},null,null,null,84.000000999999997,{"$f":"IF($C$4, 'Option vs Time'!$A$6*S122-EXP(-1*'Option vs Time'!$A$3*O122)*'Option vs Time'!$A$9*T122,-1*'Option vs Time'!$A$6*S122+EXP(-1*'Option vs Time'!$A$3*O122)*'Option vs Time'!$A$9*T122)","v":95.03321972033828},{"$f":"(LN('Option vs Time'!$A$6/'Option vs Time'!$A$9)+('Option vs Time'!$A$3+0.5*'Option vs Time'!$A$15^2)*O122)/('Option vs Time'!$A$15*SQRT(O122))","v":2.4684206816504095},{"$f":"Q122-'Option vs Time'!$A$15*SQRT(O122)","v":0.6353903927571789},0.99321446376546874,0.73741308381815784,0.16787395719549636]
[null,null,null,85.000000999999997,{"$f":"IF($C$4, 'Other Graphs'!$A$6*H123-EXP(-1*'Other Graphs'!$A$3*D123)*'Other Graphs'!$A$9*I123,-1*'Other Graphs'!$A$6*H123+EXP(-1*'Other Graphs'!$A$3*D123)*'Other Graphs'!$A$9*I123)","v":105.1406701725615},{"$f":"(LN('Other Graphs'!$A$6/'Other Graphs'!$A$9)+('Other Graphs'!$A$3+0.5*'Other Graphs'!$A$15^2)*D123)/('Other Graphs'!$A$15*SQRT(D123))","v":2.5353747406695133},{"$f":"F123-'Other Graphs'!$A$15*SQRT(D123)","v":0.69146583836441278},0.99438364540164814,0.75536357913846119,{"$f":"(F123*SQRT(D123)+SQRT(F123^2*D123-2*D123*LN('Other Graphs'!$A$6/'Other Graphs'!$A$9)-2*Data!D123^2*'Other Graphs'!$A$3))/D123","v":0.3500000000000002},{"$f":"(F123*SQRT(D123)-SQRT(F123^2*D123-2*D123*LN('Other Graphs'!$A$6/'Other Graphs'!$A$9)-2*Data!D123^2*'Other Graphs'!$A$3))/D123","v":0.1999999999999999},null,null,null,85.000000999999997,{"$f":"IF($C$4, 'Option vs Time'!$A$6*S123-EXP(-1*'Option vs Time'!$A$3*O123)*'Option vs Time'!$A$9*T123,-1*'Option vs Time'!$A$6*S123+EXP(-1*'Option vs Time'!$A$3*O123)*'Option vs Time'!$A$9*T123)","v":95.201093677533777},{"$f":"(LN('Option vs Time'!$A$6/'Option vs Time'!$A$9)+('Option vs Time'!$A$3+0.5*'Option vs Time'!$A$15^2)*O123)/('Option vs Time'!$A$15*SQRT(O123))","v":2.4836855386242407},{"$f":"Q123-'Option vs Time'!$A$15*SQRT(O123)","v":0.63977663631914017},0.99349847117122081,0.73884108801398773,0.16220560006030382]
[null,null,null,86.000000999999997,{"$f":"IF($C$4, 'Other Graphs'!$A$6*H124-EXP(-1*'Other Graphs'!$A$3*D124)*'Other Graphs'!$A$9*I124,-1*'Other Graphs'!$A$6*H124+EXP(-1*'Other Graphs'!$A$3*D124)*'Other Graphs'!$A$9*I124)","v":105.30539769318258},{"$f":"(LN('Other Graphs'!$A$6/'Other Graphs'!$A$9)+('Other Graphs'!$A$3+0.5*'Other Graphs'!$A$15^2)*D124)/('Other Graphs'!$A$15*SQRT(D124))","v":2.5502451010883251},{"$f":"F124-'Other Graphs'!$A$15*SQRT(D124)","v":0.69552139120590706},0.99461763951459503,0.75663569484905668,{"$f":"(F124*SQRT(D124)+SQRT(F124^2*D124-2*D124*LN('Other Graphs'!$A$6/'Other Graphs'!$A$9)-2*Data!D124^2*'Other Graphs'!$A$3))/D124","v":0.35000000000000009},{"$f":"(F124*SQRT(D124)-SQRT(F124^2*D124-2*D124*LN('Other Graphs'!$A$6/'Other Graphs'!$A$9)-2*Data!D124^2*'Other Graphs'!$A$3))/D124","v":0.19999999999999998},null,null,null,86.000000999999997,{"$f":"IF($C$4, 'Option vs Time'!$A$6*S124-EXP(-1*'Option vs Time'!$A$3*O124)*'Option vs Time'!$A$9*T124,-1*'Option vs Time'!$A$6*S124+EXP(-1*'Option vs Time'!$A$3*O124)*'Option vs Time'!$A$9*T124)","v":95.363299277594081},{"$f":"(LN('Option vs Time'!$A$6/'Option vs Time'!$A$9)+('Option vs Time'!$A$3+0.5*'Option vs Time'!$A$15^2)*O124)/('Option vs Time'!$A$15*SQRT(O124))","v":2.4988572963729978},{"$f":"Q124-'Option vs Time'!$A$15*SQRT(O124)","v":0.64413358649057972},0.99377027638883386,0.74025559369765626,0.15672874903776801]
[null,null,null,87.000000999999997,{"$f":"IF($C$4, 'Other Graphs'!$A$6*H125-EXP(-1*'Other Graphs'!$A$3*D125)*'Other Graphs'!$A$9*I125,-1*'Other Graphs'!$A$6*H125+EXP(-1*'Other Graphs'!$A$3*D125)*'Other Graphs'!$A$9*I125)","v":105.46454043573458},{"$f":"(LN('Other Graphs'!$A$6/'Other Graphs'!$A$9)+('Other Graphs'!$A$3+0.5*'Other Graphs'!$A$15^2)*D125)/('Other Graphs'!$A$15*SQRT(D125))","v":2.5650292543409714},{"$f":"F125-'Other Graphs'!$A$15*SQRT(D125)","v":0.69955343300208295},0.99484164468336667,0.75789688368306463,{"$f":"(F125*SQRT(D125)+SQRT(F125^2*D125-2*D125*LN('Other Graphs'!$A$6/'Other Graphs'!$A$9)-2*Data!D125^2*'Other Graphs'!$A$3))/D125","v":0.34999999999999987},{"$f":"(F125*SQRT(D125)-SQRT(F125^2*D125-2*D125*LN('Other Graphs'!$A$6/'Other Graphs'!$A$9)-2*Data!D125^2*'Other Graphs'!$A$3))/D125","v":0.20000000000000018},null,null,null,87.000000999999997,{"$f":"IF($C$4, 'Option vs Time'!$A$6*S125-EXP(-1*'Option vs Time'!$A$3*O125)*'Option vs Time'!$A$9*T125,-1*'Option vs Time'!$A$6*S125+EXP(-1*'Option vs Time'!$A$3*O125)*'Option vs Time'!$A$9*T125)","v":95.520028026631849},{"$f":"(LN('Option vs Time'!$A$6/'Option vs Time'!$A$9)+('Option vs Time'!$A$3+0.5*'Option vs Time'!$A$15^2)*O125)/('Option vs Time'!$A$15*SQRT(O125))","v":2.5139376354016711},{"$f":"Q125-'Option vs Time'!$A$15*SQRT(O125)","v":0.64846181406278269},0.99403042277892006,0.74165684941437127,0.15143690332975268]
[null,null,null,88.000000999999997,{"$f":"IF($C$4, 'Other Graphs'!$A$6*H126-EXP(-1*'Other Graphs'!$A$3*D126)*'Other Graphs'!$A$9*I126,-1*'Other Graphs'!$A$6*H126+EXP(-1*'Other Graphs'!$A$3*D126)*'Other Graphs'!$A$9*I126)","v":105.61828818463466},{"$f":"(LN('Other Graphs'!$A$6/'Other Graphs'!$A$9)+('Other Graphs'!$A$3+0.5*'Other Graphs'!$A$15^2)*D126)/('Other Graphs'!$A$15*SQRT(D126))","v":2.579728682560436},{"$f":"F126-'Other Graphs'!$A$15*SQRT(D126)","v":0.70356236797102834},0.99505610165798797,0.75914732306504185,{"$f":"(F126*SQRT(D126)+SQRT(F126^2*D126-2*D126*LN('Other Graphs'!$A$6/'Other Graphs'!$A$9)-2*Data!D126^2*'Other Graphs'!$A$3))/D126","v":0.35000000000000031},{"$f":"(F126*SQRT(D126)-SQRT(F126^2*D126-2*D126*LN('Other Graphs'!$A$6/'Other Graphs'!$A$9)-2*Data!D126^2*'Other Graphs'!$A$3))/D126","v":0.19999999999999982},null,null,null,88.000000999999997,{"$f":"IF($C$4, 'Option vs Time'!$A$6*S126-EXP(-1*'Option vs Time'!$A$3*O126)*'Option vs Time'!$A$9*T126,-1*'Option vs Time'!$A$6*S126+EXP(-1*'Option vs Time'!$A$3*O126)*'Option vs Time'!$A$9*T126)","v":95.671464929961601},{"$f":"(LN('Option vs Time'!$A$6/'Option vs Time'!$A$9)+('Option vs Time'!$A$3+0.5*'Option vs Time'!$A$15^2)*O126)/('Option vs Time'!$A$15*SQRT(O126))","v":2.528928186323415},{"$f":"Q126-'Option vs Time'!$A$15*SQRT(O126)","v":0.65276187173400735},0.99427942828554705,0.74304509609757352,0.14632378618719599]
[null,null,null,89.000000999999997,{"$f":"IF($C$4, 'Other Graphs'!$A$6*H127-EXP(-1*'Other Graphs'!$A$3*D127)*'Other Graphs'!$A$9*I127,-1*'Other Graphs'!$A$6*H127+EXP(-1*'Other Graphs'!$A$3*D127)*'Other Graphs'!$A$9*I127)","v":105.76682422578789},{"$f":"(LN('Other Graphs'!$A$6/'Other Graphs'!$A$9)+('Other Graphs'!$A$3+0.5*'Other Graphs'!$A$15^2)*D127)/('Other Graphs'!$A$15*SQRT(D127))","v":2.5943448258905368},{"$f":"F127-'Other Graphs'!$A$15*SQRT(D127)","v":0.70754858887923722},0.99526143084043228,0.76038718559311813,{"$f":"(F127*SQRT(D127)+SQRT(F127^2*D127-2*D127*LN('Other Graphs'!$A$6/'Other Graphs'!$A$9)-2*Data!D127^2*'Other Graphs'!$A$3))/D127","v":0.35},{"$f":"(F127*SQRT(D127)-SQRT(F127^2*D127-2*D127*LN('Other Graphs'!$A$6/'Other Graphs'!$A$9)-2*Data!D127^2*'Other Graphs'!$A$3))/D127","v":0.20000000000000004},null,null,null,89.000000999999997,{"$f":"IF($C$4, 'Option vs Time'!$A$6*S127-EXP(-1*'Option vs Time'!$A$3*O127)*'Option vs Time'!$A$9*T127,-1*'Option vs Time'!$A$6*S127+EXP(-1*'Option vs Time'!$A$3*O127)*'Option vs Time'!$A$9*T127)","v":95.817788716148797},{"$f":"(LN('Option vs Time'!$A$6/'Option vs Time'!$A$9)+('Option vs Time'!$A$3+0.5*'Option vs Time'!$A$15^2)*O127)/('Option vs Time'!$A$15*SQRT(O127))","v":2.5438305319065204},{"$f":"Q127-'Option vs Time'!$A$15*SQRT(O127)","v":0.65703429489522081},0.99451778670754587,0.74442056739479956,0.14138333687023419]
[null,null,null,90.000000999999997,{"$f":"IF($C$4, 'Other Graphs'!$A$6*H128-EXP(-1*'Other Graphs'!$A$3*D128)*'Other Graphs'!$A$9*I128,-1*'Other Graphs'!$A$6*H128+EXP(-1*'Other Graphs'!$A$3*D128)*'Other Graphs'!$A$9*I128)","v":105.91032557356384},{"$f":"(LN('Other Graphs'!$A$6/'Other Graphs'!$A$9)+('Other Graphs'!$A$3+0.5*'Other Graphs'!$A$15^2)*D128)/('Other Graphs'!$A$15*SQRT(D128))","v":2.6088790841326857},{"$f":"F128-'Other Graphs'!$A$15*SQRT(D128)","v":0.71151247749073265},0.99545803328368099,0.7616166392250141,{"$f":"(F128*SQRT(D128)+SQRT(F128^2*D128-2*D128*LN('Other Graphs'!$A$6/'Other Graphs'!$A$9)-2*Data!D128^2*'Other Graphs'!$A$3))/D128","v":0.35},{"$f":"(F128*SQRT(D128)-SQRT(F128^2*D128-2*D128*LN('Other Graphs'!$A$6/'Other Graphs'!$A$9)-2*Data!D128^2*'Other Graphs'!$A$3))/D128","v":0.19999999999999998},null,null,null,90.000000999999997,{"$f":"IF($C$4, 'Option vs Time'!$A$6*S128-EXP(-1*'Option vs Time'!$A$3*O128)*'Option vs Time'!$A$9*T128,-1*'Option vs Time'!$A$6*S128+EXP(-1*'Option vs Time'!$A$3*O128)*'Option vs Time'!$A$9*T128)","v":95.959172053019032},{"$f":"(LN('Option vs Time'!$A$6/'Option vs Time'!$A$9)+('Option vs Time'!$A$3+0.5*'Option vs Time'!$A$15^2)*O128)/('Option vs Time'!$A$15*SQRT(O128))","v":2.5586462090147828},{"$f":"Q128-'Option vs Time'!$A$15*SQRT(O128)","v":0.66127960237282979},0.99474596890035916,0.74578348997583865,0.13660970292643526]
[null,null,null,91.000000999999997,{"$f":"IF($C$4, 'Other Graphs'!$A$6*H129-EXP(-1*'Other Graphs'!$A$3*D129)*'Other Graphs'!$A$9*I129,-1*'Other Graphs'!$A$6*H129+EXP(-1*'Other Graphs'!$A$3*D129)*'Other Graphs'!$A$9*I129)","v":106.04896318946108},{"$f":"(LN('Other Graphs'!$A$6/'Other Graphs'!$A$9)+('Other Graphs'!$A$3+0.5*'Other Graphs'!$A$15^2)*D129)/('Other Graphs'!$A$15*SQRT(D129))","v":2.6233328183105176},{"$f":"F129-'Other Graphs'!$A$15*SQRT(D129)","v":0.71545440499377788},0.99564629163756546,0.76283584745485689,{"$f":"(F129*SQRT(D129)+SQRT(F129^2*D129-2*D129*LN('Other Graphs'!$A$6/'Other Graphs'!$A$9)-2*Data!D129^2*'Other Graphs'!$A$3))/D129","v":0.35000000000000026},{"$f":"(F129*SQRT(D129)-SQRT(F129^2*D129-2*D129*LN('Other Graphs'!$A$6/'Other Graphs'!$A$9)-2*Data!D129^2*'Other Graphs'!$A$3))/D129","v":0.19999999999999982},null,null,null,91.000000999999997,{"$f":"IF($C$4, 'Option vs Time'!$A$6*S129-EXP(-1*'Option vs Time'!$A$3*O129)*'Option vs Time'!$A$9*T129,-1*'Option vs Time'!$A$6*S129+EXP(-1*'Option vs Time'!$A$3*O129)*'Option vs Time'!$A$9*T129)","v":96.095781755945467},{"$f":"(LN('Option vs Time'!$A$6/'Option vs Time'!$A$9)+('Option vs Time'!$A$3+0.5*'Option vs Time'!$A$15^2)*O129)/('Option vs Time'!$A$15*SQRT(O129))","v":2.573376710447945},{"$f":"Q129-'Option vs Time'!$A$15*SQRT(O129)","v":0.66549829713120534},0.99496442391266615,0.74713408382433266,0.13199723277044484]
[null,null,null,92.000000999999997,{"$f":"IF($C$4, 'Other Graphs'!$A$6*H130-EXP(-1*'Other Graphs'!$A$3*D130)*'Other Graphs'!$A$9*I130,-1*'Other Graphs'!$A$6*H130+EXP(-1*'Other Graphs'!$A$3*D130)*'Other Graphs'!$A$9*I130)","v":106.18290219279665},{"$f":"(LN('Other Graphs'!$A$6/'Other Graphs'!$A$9)+('Other Graphs'!$A$3+0.5*'Other Graphs'!$A$15^2)*D130)/('Other Graphs'!$A$15*SQRT(D130))","v":2.6377073521573622},{"$f":"F130-'Other Graphs'!$A$15*SQRT(D130)","v":0.71937473240655381},0.99582657104453187,0.76404496948135758,{"$f":"(F130*SQRT(D130)+SQRT(F130^2*D130-2*D130*LN('Other Graphs'!$A$6/'Other Graphs'!$A$9)-2*Data!D130^2*'Other Graphs'!$A$3))/D130","v":0.3500000000000002},{"$f":"(F130*SQRT(D130)-SQRT(F130^2*D130-2*D130*LN('Other Graphs'!$A$6/'Other Graphs'!$A$9)-2*Data!D130^2*'Other Graphs'!$A$3))/D130","v":0.19999999999999987},null,null,null,92.000000999999997,{"$f":"IF($C$4, 'Option vs Time'!$A$6*S130-EXP(-1*'Option vs Time'!$A$3*O130)*'Option vs Time'!$A$9*T130,-1*'Option vs Time'!$A$6*S130+EXP(-1*'Option vs Time'!$A$3*O130)*'Option vs Time'!$A$9*T130)","v":96.227778988715912},{"$f":"(LN('Option vs Time'!$A$6/'Option vs Time'!$A$9)+('Option vs Time'!$A$3+0.5*'Option vs Time'!$A$15^2)*O130)/('Option vs Time'!$A$15*SQRT(O130))","v":2.5880234866884502},{"$f":"Q130-'Option vs Time'!$A$15*SQRT(O130)","v":0.66969086693764179},0.99517358006172463,0.74847256251389926,0.12754046855204138]
[null,null,null,93.000000999999997,{"$f":"IF($C$4, 'Other Graphs'!$A$6*H131-EXP(-1*'Other Graphs'!$A$3*D131)*'Other Graphs'!$A$9*I131,-1*'Other Graphs'!$A$6*H131+EXP(-1*'Other Graphs'!$A$3*D131)*'Other Graphs'!$A$9*I131)","v":106.31230206374197},{"$f":"(LN('Other Graphs'!$A$6/'Other Graphs'!$A$9)+('Other Graphs'!$A$3+0.5*'Other Graphs'!$A$15^2)*D131)/('Other Graphs'!$A$15*SQRT(D131))","v":2.6520039735311487},{"$f":"F131-'Other Graphs'!$A$15*SQRT(D131)","v":0.72327381096304078},0.99599921998826046,0.76524416036785603,{"$f":"(F131*SQRT(D131)+SQRT(F131^2*D131-2*D131*LN('Other Graphs'!$A$6/'Other Graphs'!$A$9)-2*Data!D131^2*'Other Graphs'!$A$3))/D131","v":0.35000000000000009},{"$f":"(F131*SQRT(D131)-SQRT(F131^2*D131-2*D131*LN('Other Graphs'!$A$6/'Other Graphs'!$A$9)-2*Data!D131^2*'Other Graphs'!$A$3))/D131","v":0.19999999999999996},null,null,null,93.000000999999997,{"$f":"IF($C$4, 'Option vs Time'!$A$6*S131-EXP(-1*'Option vs Time'!$A$3*O131)*'Option vs Time'!$A$9*T131,-1*'Option vs Time'!$A$6*S131+EXP(-1*'Option vs Time'!$A$3*O131)*'Option vs Time'!$A$9*T131)","v":96.355319457267953},{"$f":"(LN('Option vs Time'!$A$6/'Option vs Time'!$A$9)+('Option vs Time'!$A$3+0.5*'Option vs Time'!$A$15^2)*O131)/('Option vs Time'!$A$15*SQRT(O131))","v":2.6025879475602482},{"$f":"Q131-'Option vs Time'!$A$15*SQRT(O131)","v":0.67385778499214033},0.99537384595110179,0.7497991334697599,0.12323413929884453]
[null,null,null,94.000000999999997,{"$f":"IF($C$4, 'Other Graphs'!$A$6*H132-EXP(-1*'Other Graphs'!$A$3*D132)*'Other Graphs'!$A$9*I132,-1*'Other Graphs'!$A$6*H132+EXP(-1*'Other Graphs'!$A$3*D132)*'Other Graphs'!$A$9*I132)","v":106.43731683900988},{"$f":"(LN('Other Graphs'!$A$6/'Other Graphs'!$A$9)+('Other Graphs'!$A$3+0.5*'Other Graphs'!$A$15^2)*D132)/('Other Graphs'!$A$15*SQRT(D132))","v":2.6662239357610233},{"$f":"F132-'Other Graphs'!$A$15*SQRT(D132)","v":0.72715198248027901},0.99616457109787693,0.76643357119471345,{"$f":"(F132*SQRT(D132)+SQRT(F132^2*D132-2*D132*LN('Other Graphs'!$A$6/'Other Graphs'!$A$9)-2*Data!D132^2*'Other Graphs'!$A$3))/D132","v":0.35000000000000014},{"$f":"(F132*SQRT(D132)-SQRT(F132^2*D132-2*D132*LN('Other Graphs'!$A$6/'Other Graphs'!$A$9)-2*Data!D132^2*'Other Graphs'!$A$3))/D132","v":0.19999999999999993},null,null,null,94.000000999999997,{"$f":"IF($C$4, 'Option vs Time'!$A$6*S132-EXP(-1*'Option vs Time'!$A$3*O132)*'Option vs Time'!$A$9*T132,-1*'Option vs Time'!$A$6*S132+EXP(-1*'Option vs Time'!$A$3*O132)*'Option vs Time'!$A$9*T132)","v":96.478553596566798},{"$f":"(LN('Option vs Time'!$A$6/'Option vs Time'!$A$9)+('Option vs Time'!$A$3+0.5*'Option vs Time'!$A$15^2)*O132)/('Option vs Time'!$A$15*SQRT(O132))","v":2.6170714638050092},{"$f":"Q132-'Option vs Time'!$A$15*SQRT(O132)","v":0.67799951052426488},0.99556561143421896,0.75111399821679448,0.11907315432117116]
[null,null,null,95.000000999999997,{"$f":"IF($C$4, 'Other Graphs'!$A$6*H133-EXP(-1*'Other Graphs'!$A$3*D133)*'Other Graphs'!$A$9*I133,-1*'Other Graphs'!$A$6*H133+EXP(-1*'Other Graphs'!$A$3*D133)*'Other Graphs'!$A$9*I133)","v":106.55809530048434},{"$f":"(LN('Other Graphs'!$A$6/'Other Graphs'!$A$9)+('Other Graphs'!$A$3+0.5*'Other Graphs'!$A$15^2)*D133)/('Other Graphs'!$A$15*SQRT(D133))","v":2.6803684589296672},{"$f":"F133-'Other Graphs'!$A$15*SQRT(D133)","v":0.73100957970809066},0.99632294191031745,0.76761334920449409,{"$f":"(F133*SQRT(D133)+SQRT(F133^2*D133-2*D133*LN('Other Graphs'!$A$6/'Other Graphs'!$A$9)-2*Data!D133^2*'Other Graphs'!$A$3))/D133","v":0.34999999999999992},{"$f":"(F133*SQRT(D133)-SQRT(F133^2*D133-2*D133*LN('Other Graphs'!$A$6/'Other Graphs'!$A$9)-2*Data!D133^2*'Other Graphs'!$A$3))/D133","v":0.20000000000000015},null,null,null,95.000000999999997,{"$f":"IF($C$4, 'Option vs Time'!$A$6*S133-EXP(-1*'Option vs Time'!$A$3*O133)*'Option vs Time'!$A$9*T133,-1*'Option vs Time'!$A$6*S133+EXP(-1*'Option vs Time'!$A$3*O133)*'Option vs Time'!$A$9*T133)","v":96.597626750887969},{"$f":"(LN('Option vs Time'!$A$6/'Option vs Time'!$A$9)+('Option vs Time'!$A$3+0.5*'Option vs Time'!$A$15^2)*O133)/('Option vs Time'!$A$15*SQRT(O133))","v":2.6314753685807091},{"$f":"Q133-'Option vs Time'!$A$15*SQRT(O133)","v":0.68211648935913249},0.99574924852690394,0.75241735261486709,0.1150525968674998]
[null,null,null,96.000000999999997,{"$f":"IF($C$4, 'Other Graphs'!$A$6*H134-EXP(-1*'Other Graphs'!$A$3*D134)*'Other Graphs'!$A$9*I134,-1*'Other Graphs'!$A$6*H134+EXP(-1*'Other Graphs'!$A$3*D134)*'Other Graphs'!$A$9*I134)","v":106.67478115706956},{"$f":"(LN('Other Graphs'!$A$6/'Other Graphs'!$A$9)+('Other Graphs'!$A$3+0.5*'Other Graphs'!$A$15^2)*D134)/('Other Graphs'!$A$15*SQRT(D134))","v":2.6944387310950311},{"$f":"F134-'Other Graphs'!$A$15*SQRT(D134)","v":0.73484692666228124},0.99647463559324134,0.76878363794035298,{"$f":"(F134*SQRT(D134)+SQRT(F134^2*D134-2*D134*LN('Other Graphs'!$A$6/'Other Graphs'!$A$9)-2*Data!D134^2*'Other Graphs'!$A$3))/D134","v":0.35000000000000003},{"$f":"(F134*SQRT(D134)-SQRT(F134^2*D134-2*D134*LN('Other Graphs'!$A$6/'Other Graphs'!$A$9)-2*Data!D134^2*'Other Graphs'!$A$3))/D134","v":0.20000000000000007},null,null,null,96.000000999999997,{"$f":"IF($C$4, 'Option vs Time'!$A$6*S134-EXP(-1*'Option vs Time'!$A$3*O134)*'Option vs Time'!$A$9*T134,-1*'Option vs Time'!$A$6*S134+EXP(-1*'Option vs Time'!$A$3*O134)*'Option vs Time'!$A$9*T134)","v":96.712679347755468},{"$f":"(LN('Option vs Time'!$A$6/'Option vs Time'!$A$9)+('Option vs Time'!$A$3+0.5*'Option vs Time'!$A$15^2)*O134)/('Option vs Time'!$A$15*SQRT(O134))","v":2.6458009588872038},{"$f":"Q134-'Option vs Time'!$A$15*SQRT(O134)","v":0.68620915445445396},0.99592511227193237,0.75370938708221236,0.1111677180190469]
[null,null,null,97.000000999999997,{"$f":"IF($C$4, 'Other Graphs'!$A$6*H135-EXP(-1*'Other Graphs'!$A$3*D135)*'Other Graphs'!$A$9*I135,-1*'Other Graphs'!$A$6*H135+EXP(-1*'Other Graphs'!$A$3*D135)*'Other Graphs'!$A$9*I135)","v":106.78751322002334},{"$f":"(LN('Other Graphs'!$A$6/'Other Graphs'!$A$9)+('Other Graphs'!$A$3+0.5*'Other Graphs'!$A$15^2)*D135)/('Other Graphs'!$A$15*SQRT(D135))","v":2.7084359094549391},{"$f":"F135-'Other Graphs'!$A$15*SQRT(D135)","v":0.73866433894225647},0.99661994163073142,0.76994457737801281,{"$f":"(F135*SQRT(D135)+SQRT(F135^2*D135-2*D135*LN('Other Graphs'!$A$6/'Other Graphs'!$A$9)-2*Data!D135^2*'Other Graphs'!$A$3))/D135","v":0.35000000000000026},{"$f":"(F135*SQRT(D135)-SQRT(F135^2*D135-2*D135*LN('Other Graphs'!$A$6/'Other Graphs'!$A$9)-2*Data!D135^2*'Other Graphs'!$A$3))/D135","v":0.19999999999999987},null,null,null,97.000000999999997,{"$f":"IF($C$4, 'Option vs Time'!$A$6*S135-EXP(-1*'Option vs Time'!$A$3*O135)*'Option vs Time'!$A$9*T135,-1*'Option vs Time'!$A$6*S135+EXP(-1*'Option vs Time'!$A$3*O135)*'Option vs Time'!$A$9*T135)","v":96.823847065774515},{"$f":"(LN('Option vs Time'!$A$6/'Option vs Time'!$A$9)+('Option vs Time'!$A$3+0.5*'Option vs Time'!$A$15^2)*O135)/('Option vs Time'!$A$15*SQRT(O135))","v":2.660049496923095},{"$f":"Q135-'Option vs Time'!$A$15*SQRT(O135)","v":0.69027792641041241},0.99609354155834606,0.75499028680761193,0.10741393081367789]
[null,null,null,98.000000999999997,{"$f":"IF($C$4, 'Other Graphs'!$A$6*H136-EXP(-1*'Other Graphs'!$A$3*D136)*'Other Graphs'!$A$9*I136,-1*'Other Graphs'!$A$6*H136+EXP(-1*'Other Graphs'!$A$3*D136)*'Other Graphs'!$A$9*I136)","v":106.89642557202667},{"$f":"(LN('Other Graphs'!$A$6/'Other Graphs'!$A$9)+('Other Graphs'!$A$3+0.5*'Other Graphs'!$A$15^2)*D136)/('Other Graphs'!$A$15*SQRT(D136))","v":2.7223611214578058},{"$f":"F136-'Other Graphs'!$A$15*SQRT(D136)","v":0.74246212403394729},0.99675913647388326,0.77109630405169416,{"$f":"(F136*SQRT(D136)+SQRT(F136^2*D136-2*D136*LN('Other Graphs'!$A$6/'Other Graphs'!$A$9)-2*Data!D136^2*'Other Graphs'!$A$3))/D136","v":0.35000000000000014},{"$f":"(F136*SQRT(D136)-SQRT(F136^2*D136-2*D136*LN('Other Graphs'!$A$6/'Other Graphs'!$A$9)-2*Data!D136^2*'Other Graphs'!$A$3))/D136","v":0.19999999999999998},null,null,null,98.000000999999997,{"$f":"IF($C$4, 'Option vs Time'!$A$6*S136-EXP(-1*'Option vs Time'!$A$3*O136)*'Option vs Time'!$A$9*T136,-1*'Option vs Time'!$A$6*S136+EXP(-1*'Option vs Time'!$A$3*O136)*'Option vs Time'!$A$9*T136)","v":96.931260996588193},{"$f":"(LN('Option vs Time'!$A$6/'Option vs Time'!$A$9)+('Option vs Time'!$A$3+0.5*'Option vs Time'!$A$15^2)*O136)/('Option vs Time'!$A$15*SQRT(O136))","v":2.6742222113778786},{"$f":"Q136-'Option vs Time'!$A$15*SQRT(O136)","v":0.69432321395402008},0.99625485989815232,0.75626023195203818,0.10378680458840961]
[null,null,null,99.000000999999997,{"$f":"IF($C$4, 'Other Graphs'!$A$6*H137-EXP(-1*'Other Graphs'!$A$3*D137)*'Other Graphs'!$A$9*I137,-1*'Other Graphs'!$A$6*H137+EXP(-1*'Other Graphs'!$A$3*D137)*'Other Graphs'!$A$9*I137)","v":107.00164773023084},{"$f":"(LN('Other Graphs'!$A$6/'Other Graphs'!$A$9)+('Other Graphs'!$A$3+0.5*'Other Graphs'!$A$15^2)*D137)/('Other Graphs'!$A$15*SQRT(D137))","v":2.7362154658624749},{"$f":"F137-'Other Graphs'!$A$15*SQRT(D137)","v":0.74624058159885687},0.99689248415824949,0.7722389511743325,{"$f":"(F137*SQRT(D137)+SQRT(F137^2*D137-2*D137*LN('Other Graphs'!$A$6/'Other Graphs'!$A$9)-2*Data!D137^2*'Other Graphs'!$A$3))/D137","v":0.35000000000000014},{"$f":"(F137*SQRT(D137)-SQRT(F137^2*D137-2*D137*LN('Other Graphs'!$A$6/'Other Graphs'!$A$9)-2*Data!D137^2*'Other Graphs'!$A$3))/D137","v":0.1999999999999999},null,null,null,99.000000999999997,{"$f":"IF($C$4, 'Option vs Time'!$A$6*S137-EXP(-1*'Option vs Time'!$A$3*O137)*'Option vs Time'!$A$9*T137,-1*'Option vs Time'!$A$6*S137+EXP(-1*'Option vs Time'!$A$3*O137)*'Option vs Time'!$A$9*T137)","v":97.035047801176603},{"$f":"(LN('Option vs Time'!$A$6/'Option vs Time'!$A$9)+('Option vs Time'!$A$3+0.5*'Option vs Time'!$A$15^2)*O137)/('Option vs Time'!$A$15*SQRT(O137))","v":2.6883202986631192},{"$f":"Q137-'Option vs Time'!$A$15*SQRT(O137)","v":0.69834541439950115},0.99640937616284064,0.75751939784039879,0.10028205953204861]
[null,null,null,100.000001,{"$f":"IF($C$4, 'Other Graphs'!$A$6*H138-EXP(-1*'Other Graphs'!$A$3*D138)*'Other Graphs'!$A$9*I138,-1*'Other Graphs'!$A$6*H138+EXP(-1*'Other Graphs'!$A$3*D138)*'Other Graphs'!$A$9*I138)","v":107.10330480351215},{"$f":"(LN('Other Graphs'!$A$6/'Other Graphs'!$A$9)+('Other Graphs'!$A$3+0.5*'Other Graphs'!$A$15^2)*D138)/('Other Graphs'!$A$15*SQRT(D138))","v":2.7500000137499998},{"$f":"F138-'Other Graphs'!$A$15*SQRT(D138)","v":0.75000000374999942},0.99702023688998198,0.77337264875239708,{"$f":"(F138*SQRT(D138)+SQRT(F138^2*D138-2*D138*LN('Other Graphs'!$A$6/'Other Graphs'!$A$9)-2*Data!D138^2*'Other Graphs'!$A$3))/D138","v":0.34999999999999987},{"$f":"(F138*SQRT(D138)-SQRT(F138^2*D138-2*D138*LN('Other Graphs'!$A$6/'Other Graphs'!$A$9)-2*Data!D138^2*'Other Graphs'!$A$3))/D138","v":0.20000000000000012},null,null,null,100.000001,{"$f":"IF($C$4, 'Option vs Time'!$A$6*S138-EXP(-1*'Option vs Time'!$A$3*O138)*'Option vs Time'!$A$9*T138,-1*'Option vs Time'!$A$6*S138+EXP(-1*'Option vs Time'!$A$3*O138)*'Option vs Time'!$A$9*T138)","v":97.135329860708651},{"$f":"(LN('Option vs Time'!$A$6/'Option vs Time'!$A$9)+('Option vs Time'!$A$3+0.5*'Option vs Time'!$A$15^2)*O138)/('Option vs Time'!$A$15*SQRT(O138))","v":2.702344924086113},{"$f":"Q138-'Option vs Time'!$A$15*SQRT(O138)","v":0.70234491408611266},0.99655738528199933,0.75876795514396278,9.6895561438358868E-2]
[null,null,null,101.000001,{"$f":"IF($C$4, 'Other Graphs'!$A$6*H139-EXP(-1*'Other Graphs'!$A$3*D139)*'Other Graphs'!$A$9*I139,-1*'Other Graphs'!$A$6*H139+EXP(-1*'Other Graphs'!$A$3*D139)*'Other Graphs'!$A$9*I139)","v":107.20151764415424},{"$f":"(LN('Other Graphs'!$A$6/'Other Graphs'!$A$9)+('Other Graphs'!$A$3+0.5*'Other Graphs'!$A$15^2)*D139)/('Other Graphs'!$A$15*SQRT(D139))","v":2.7637158094900065},{"$f":"F139-'Other Graphs'!$A$15*SQRT(D139)","v":0.75374067531545652},0.99714263560240479,0.77449752369560887,{"$f":"(F139*SQRT(D139)+SQRT(F139^2*D139-2*D139*LN('Other Graphs'!$A$6/'Other Graphs'!$A$9)-2*Data!D139^2*'Other Graphs'!$A$3))/D139","v":0.35000000000000014},{"$f":"(F139*SQRT(D139)-SQRT(F139^2*D139-2*D139*LN('Other Graphs'!$A$6/'Other Graphs'!$A$9)-2*Data!D139^2*'Other Graphs'!$A$3))/D139","v":0.19999999999999996},null,null,null,101.000001,{"$f":"IF($C$4, 'Option vs Time'!$A$6*S139-EXP(-1*'Option vs Time'!$A$3*O139)*'Option vs Time'!$A$9*T139,-1*'Option vs Time'!$A$6*S139+EXP(-1*'Option vs Time'!$A$3*O139)*'Option vs Time'!$A$9*T139)","v":97.23222542214701},{"$f":"(LN('Option vs Time'!$A$6/'Option vs Time'!$A$9)+('Option vs Time'!$A$3+0.5*'Option vs Time'!$A$15^2)*O139)/('Option vs Time'!$A$15*SQRT(O139))","v":2.7162972229692999},{"$f":"Q139-'Option vs Time'!$A$15*SQRT(O139)","v":0.70632208879474989},0.99669916890616728,0.7600060700540221,9.3623316651942901E-2]
[null,null,null,102.000001,{"$f":"IF($C$4, 'Other Graphs'!$A$6*H140-EXP(-1*'Other Graphs'!$A$3*D140)*'Other Graphs'!$A$9*I140,-1*'Other Graphs'!$A$6*H140+EXP(-1*'Other Graphs'!$A$3*D140)*'Other Graphs'!$A$9*I140)","v":107.29640299416916},{"$f":"(LN('Other Graphs'!$A$6/'Other Graphs'!$A$9)+('Other Graphs'!$A$3+0.5*'Other Graphs'!$A$15^2)*D140)/('Other Graphs'!$A$15*SQRT(D140))","v":2.7773638716640998},{"$f":"F140-'Other Graphs'!$A$15*SQRT(D140)","v":0.75746287409020852},0.99725991048464069,0.77561369992182749,{"$f":"(F140*SQRT(D140)+SQRT(F140^2*D140-2*D140*LN('Other Graphs'!$A$6/'Other Graphs'!$A$9)-2*Data!D140^2*'Other Graphs'!$A$3))/D140","v":0.34999999999999992},{"$f":"(F140*SQRT(D140)-SQRT(F140^2*D140-2*D140*LN('Other Graphs'!$A$6/'Other Graphs'!$A$9)-2*Data!D140^2*'Other Graphs'!$A$3))/D140","v":0.20000000000000009},null,null,null,102.000001,{"$f":"IF($C$4, 'Option vs Time'!$A$6*S140-EXP(-1*'Option vs Time'!$A$3*O140)*'Option vs Time'!$A$9*T140,-1*'Option vs Time'!$A$6*S140+EXP(-1*'Option vs Time'!$A$3*O140)*'Option vs Time'!$A$9*T140)","v":97.325848738798953},{"$f":"(LN('Option vs Time'!$A$6/'Option vs Time'!$A$9)+('Option vs Time'!$A$3+0.5*'Option vs Time'!$A$15^2)*O140)/('Option vs Time'!$A$15*SQRT(O140))","v":2.7301783017184431},{"$f":"Q140-'Option vs Time'!$A$15*SQRT(O140)","v":0.71027730414455181},0.99683499603592329,0.76123390444728689,9.046146719865078E-2]
[null,null,null,103.000001,{"$f":"IF($C$4, 'Other Graphs'!$A$6*H141-EXP(-1*'Other Graphs'!$A$3*D141)*'Other Graphs'!$A$9*I141,-1*'Other Graphs'!$A$6*H141+EXP(-1*'Other Graphs'!$A$3*D141)*'Other Graphs'!$A$9*I141)","v":107.38807362645774},{"$f":"(LN('Other Graphs'!$A$6/'Other Graphs'!$A$9)+('Other Graphs'!$A$3+0.5*'Other Graphs'!$A$15^2)*D141)/('Other Graphs'!$A$15*SQRT(D141))","v":2.7909451939486383},{"$f":"F141-'Other Graphs'!$A$15*SQRT(D141)","v":0.76116687107690151},0.99737228148381507,0.77672129845737437,{"$f":"(F141*SQRT(D141)+SQRT(F141^2*D141-2*D141*LN('Other Graphs'!$A$6/'Other Graphs'!$A$9)-2*Data!D141^2*'Other Graphs'!$A$3))/D141","v":0.3500000000000002},{"$f":"(F141*SQRT(D141)-SQRT(F141^2*D141-2*D141*LN('Other Graphs'!$A$6/'Other Graphs'!$A$9)-2*Data!D141^2*'Other Graphs'!$A$3))/D141","v":0.1999999999999999},null,null,null,103.000001,{"$f":"IF($C$4, 'Option vs Time'!$A$6*S141-EXP(-1*'Option vs Time'!$A$3*O141)*'Option vs Time'!$A$9*T141,-1*'Option vs Time'!$A$6*S141+EXP(-1*'Option vs Time'!$A$3*O141)*'Option vs Time'!$A$9*T141)","v":97.416310205997604},{"$f":"(LN('Option vs Time'!$A$6/'Option vs Time'!$A$9)+('Option vs Time'!$A$3+0.5*'Option vs Time'!$A$15^2)*O141)/('Option vs Time'!$A$15*SQRT(O141))","v":2.7439892388424276},{"$f":"Q141-'Option vs Time'!$A$15*SQRT(O141)","v":0.71421091597069086},0.99696512361909184,0.76245161604350165,8.7406286092715391E-2]
[null,null,null,104.000001,{"$f":"IF($C$4, 'Other Graphs'!$A$6*H142-EXP(-1*'Other Graphs'!$A$3*D142)*'Other Graphs'!$A$9*I142,-1*'Other Graphs'!$A$6*H142+EXP(-1*'Other Graphs'!$A$3*D142)*'Other Graphs'!$A$9*I142)","v":107.47663848100321},{"$f":"(LN('Other Graphs'!$A$6/'Other Graphs'!$A$9)+('Other Graphs'!$A$3+0.5*'Other Graphs'!$A$15^2)*D142)/('Other Graphs'!$A$15*SQRT(D142))","v":2.8044607459590161},{"$f":"F142-'Other Graphs'!$A$15*SQRT(D142)","v":0.76485293071609517},0.99747995878227436,0.77782043753302144,{"$f":"(F142*SQRT(D142)+SQRT(F142^2*D142-2*D142*LN('Other Graphs'!$A$6/'Other Graphs'!$A$9)-2*Data!D142^2*'Other Graphs'!$A$3))/D142","v":0.35},{"$f":"(F142*SQRT(D142)-SQRT(F142^2*D142-2*D142*LN('Other Graphs'!$A$6/'Other Graphs'!$A$9)-2*Data!D142^2*'Other Graphs'!$A$3))/D142","v":0.20000000000000007},null,null,null,104.000001,{"$f":"IF($C$4, 'Option vs Time'!$A$6*S142-EXP(-1*'Option vs Time'!$A$3*O142)*'Option vs Time'!$A$9*T142,-1*'Option vs Time'!$A$6*S142+EXP(-1*'Option vs Time'!$A$3*O142)*'Option vs Time'!$A$9*T142)","v":97.503716492090319},{"$f":"(LN('Option vs Time'!$A$6/'Option vs Time'!$A$9)+('Option vs Time'!$A$3+0.5*'Option vs Time'!$A$15^2)*O142)/('Option vs Time'!$A$15*SQRT(O142))","v":2.7577310859273036},{"$f":"Q142-'Option vs Time'!$A$15*SQRT(O142)","v":0.71812327068438275},0.99708979711782431,0.76365935855571021,8.4454172814375283E-2]
[null,null,null,105.000001,{"$f":"IF($C$4, 'Other Graphs'!$A$6*H143-EXP(-1*'Other Graphs'!$A$3*D143)*'Other Graphs'!$A$9*I143,-1*'Other Graphs'!$A$6*H143+EXP(-1*'Other Graphs'!$A$3*D143)*'Other Graphs'!$A$9*I143)","v":107.56220279628204},{"$f":"(LN('Other Graphs'!$A$6/'Other Graphs'!$A$9)+('Other Graphs'!$A$3+0.5*'Other Graphs'!$A$15^2)*D143)/('Other Graphs'!$A$15*SQRT(D143))","v":2.8179114740575155},{"$f":"F143-'Other Graphs'!$A$15*SQRT(D143)","v":0.76852131110659494},0.99758314325116137,0.77891123267588647,{"$f":"(F143*SQRT(D143)+SQRT(F143^2*D143-2*D143*LN('Other Graphs'!$A$6/'Other Graphs'!$A$9)-2*Data!D143^2*'Other Graphs'!$A$3))/D143","v":0.35000000000000003},{"$f":"(F143*SQRT(D143)-SQRT(F143^2*D143-2*D143*LN('Other Graphs'!$A$6/'Other Graphs'!$A$9)-2*Data!D143^2*'Other Graphs'!$A$3))/D143","v":0.19999999999999996},null,null,null,105.000001,{"$f":"IF($C$4, 'Option vs Time'!$A$6*S143-EXP(-1*'Option vs Time'!$A$3*O143)*'Option vs Time'!$A$9*T143,-1*'Option vs Time'!$A$6*S143+EXP(-1*'Option vs Time'!$A$3*O143)*'Option vs Time'!$A$9*T143)","v":97.588170664904695},{"$f":"(LN('Option vs Time'!$A$6/'Option vs Time'!$A$9)+('Option vs Time'!$A$3+0.5*'Option vs Time'!$A$15^2)*O143)/('Option vs Time'!$A$15*SQRT(O143))","v":2.7714048685670862},{"$f":"Q143-'Option vs Time'!$A$15*SQRT(O143)","v":0.72201470561616565},0.99720925104721281,0.76485728183359747,8.1601648949757077E-2]
[null,null,null,106.000001,{"$f":"IF($C$4, 'Other Graphs'!$A$6*H144-EXP(-1*'Other Graphs'!$A$3*D144)*'Other Graphs'!$A$9*I144,-1*'Other Graphs'!$A$6*H144+EXP(-1*'Other Graphs'!$A$3*D144)*'Other Graphs'!$A$9*I144)","v":107.64486823606958},{"$f":"(LN('Other Graphs'!$A$6/'Other Graphs'!$A$9)+('Other Graphs'!$A$3+0.5*'Other Graphs'!$A$15^2)*D144)/('Other Graphs'!$A$15*SQRT(D144))","v":2.8312983021266063},{"$f":"F144-'Other Graphs'!$A$15*SQRT(D144)","v":0.77217226421634777},0.99768202688161911,0.77999379679743541,{"$f":"(F144*SQRT(D144)+SQRT(F144^2*D144-2*D144*LN('Other Graphs'!$A$6/'Other Graphs'!$A$9)-2*Data!D144^2*'Other Graphs'!$A$3))/D144","v":0.35000000000000014},{"$f":"(F144*SQRT(D144)-SQRT(F144^2*D144-2*D144*LN('Other Graphs'!$A$6/'Other Graphs'!$A$9)-2*Data!D144^2*'Other Graphs'!$A$3))/D144","v":0.19999999999999993},null,null,null,106.000001,{"$f":"IF($C$4, 'Option vs Time'!$A$6*S144-EXP(-1*'Option vs Time'!$A$3*O144)*'Option vs Time'!$A$9*T144,-1*'Option vs Time'!$A$6*S144+EXP(-1*'Option vs Time'!$A$3*O144)*'Option vs Time'!$A$9*T144)","v":97.669772313854452},{"$f":"(LN('Option vs Time'!$A$6/'Option vs Time'!$A$9)+('Option vs Time'!$A$3+0.5*'Option vs Time'!$A$15^2)*O144)/('Option vs Time'!$A$15*SQRT(O144))","v":2.7850115872536052},{"$f":"Q144-'Option vs Time'!$A$15*SQRT(O144)","v":0.7258855493433467},0.99732370948698557,0.76604553200028114,7.8845353987858857E-2]
[null,null,null,107.000001,{"$f":"IF($C$4, 'Other Graphs'!$A$6*H145-EXP(-1*'Other Graphs'!$A$3*D145)*'Other Graphs'!$A$9*I145,-1*'Other Graphs'!$A$6*H145+EXP(-1*'Other Graphs'!$A$3*D145)*'Other Graphs'!$A$9*I145)","v":107.72473301181023},{"$f":"(LN('Other Graphs'!$A$6/'Other Graphs'!$A$9)+('Other Graphs'!$A$3+0.5*'Other Graphs'!$A$15^2)*D145)/('Other Graphs'!$A$15*SQRT(D145))","v":2.8446221323094925},{"$f":"F145-'Other Graphs'!$A$15*SQRT(D145)","v":0.77580603608440768},0.99777679319481305,0.78106824027779909,{"$f":"(F145*SQRT(D145)+SQRT(F145^2*D145-2*D145*LN('Other Graphs'!$A$6/'Other Graphs'!$A$9)-2*Data!D145^2*'Other Graphs'!$A$3))/D145","v":0.35000000000000026},{"$f":"(F145*SQRT(D145)-SQRT(F145^2*D145-2*D145*LN('Other Graphs'!$A$6/'Other Graphs'!$A$9)-2*Data!D145^2*'Other Graphs'!$A$3))/D145","v":0.19999999999999987},null,null,null,107.000001,{"$f":"IF($C$4, 'Option vs Time'!$A$6*S145-EXP(-1*'Option vs Time'!$A$3*O145)*'Option vs Time'!$A$9*T145,-1*'Option vs Time'!$A$6*S145+EXP(-1*'Option vs Time'!$A$3*O145)*'Option vs Time'!$A$9*T145)","v":97.748617667842311},{"$f":"(LN('Option vs Time'!$A$6/'Option vs Time'!$A$9)+('Option vs Time'!$A$3+0.5*'Option vs Time'!$A$15^2)*O145)/('Option vs Time'!$A$15*SQRT(O145))","v":2.7985522182276004},{"$f":"Q145-'Option vs Time'!$A$15*SQRT(O145)","v":0.72973612200251559},0.99743338656774705,0.76722425158292118,7.6182041267898626E-2]
[null,null,null,108.000001,{"$f":"IF($C$4, 'Other Graphs'!$A$6*H146-EXP(-1*'Other Graphs'!$A$3*D146)*'Other Graphs'!$A$9*I146,-1*'Other Graphs'!$A$6*H146+EXP(-1*'Other Graphs'!$A$3*D146)*'Other Graphs'!$A$9*I146)","v":107.80189200071462},{"$f":"(LN('Other Graphs'!$A$6/'Other Graphs'!$A$9)+('Other Graphs'!$A$3+0.5*'Other Graphs'!$A$15^2)*D146)/('Other Graphs'!$A$15*SQRT(D146))","v":2.8578838457195914},{"$f":"F146-'Other Graphs'!$A$15*SQRT(D146)","v":0.77942286701443431},0.9978676176318948,0.78213467104659162,{"$f":"(F146*SQRT(D146)+SQRT(F146^2*D146-2*D146*LN('Other Graphs'!$A$6/'Other Graphs'!$A$9)-2*Data!D146^2*'Other Graphs'!$A$3))/D146","v":0.35000000000000003},{"$f":"(F146*SQRT(D146)-SQRT(F146^2*D146-2*D146*LN('Other Graphs'!$A$6/'Other Graphs'!$A$9)-2*Data!D146^2*'Other Graphs'!$A$3))/D146","v":0.19999999999999993},null,null,null,108.000001,{"$f":"IF($C$4, 'Option vs Time'!$A$6*S146-EXP(-1*'Option vs Time'!$A$3*O146)*'Option vs Time'!$A$9*T146,-1*'Option vs Time'!$A$6*S146+EXP(-1*'Option vs Time'!$A$3*O146)*'Option vs Time'!$A$9*T146)","v":97.824799709110209},{"$f":"(LN('Option vs Time'!$A$6/'Option vs Time'!$A$9)+('Option vs Time'!$A$3+0.5*'Option vs Time'!$A$15^2)*O146)/('Option vs Time'!$A$15*SQRT(O146))","v":2.8120277142931065},{"$f":"Q146-'Option vs Time'!$A$15*SQRT(O146)","v":0.73356673558794938},0.99753848693313274,0.768393579637487,7.3608574070760824E-2]
[null,null,null,109.000001,{"$f":"IF($C$4, 'Other Graphs'!$A$6*H147-EXP(-1*'Other Graphs'!$A$3*D147)*'Other Graphs'!$A$9*I147,-1*'Other Graphs'!$A$6*H147+EXP(-1*'Other Graphs'!$A$3*D147)*'Other Graphs'!$A$9*I147)","v":107.87643685974028},{"$f":"(LN('Other Graphs'!$A$6/'Other Graphs'!$A$9)+('Other Graphs'!$A$3+0.5*'Other Graphs'!$A$15^2)*D147)/('Other Graphs'!$A$15*SQRT(D147))","v":2.8710843031205124},{"$f":"F147-'Other Graphs'!$A$15*SQRT(D147)","v":0.78302299176013923},0.99795466792496479,0.78319319466040338,{"$f":"(F147*SQRT(D147)+SQRT(F147^2*D147-2*D147*LN('Other Graphs'!$A$6/'Other Graphs'!$A$9)-2*Data!D147^2*'Other Graphs'!$A$3))/D147","v":0.34999999999999987},{"$f":"(F147*SQRT(D147)-SQRT(F147^2*D147-2*D147*LN('Other Graphs'!$A$6/'Other Graphs'!$A$9)-2*Data!D147^2*'Other Graphs'!$A$3))/D147","v":0.20000000000000009},null,null,null,109.000001,{"$f":"IF($C$4, 'Option vs Time'!$A$6*S147-EXP(-1*'Option vs Time'!$A$3*O147)*'Option vs Time'!$A$9*T147,-1*'Option vs Time'!$A$6*S147+EXP(-1*'Option vs Time'!$A$3*O147)*'Option vs Time'!$A$9*T147)","v":97.89840828318097},{"$f":"(LN('Option vs Time'!$A$6/'Option vs Time'!$A$9)+('Option vs Time'!$A$3+0.5*'Option vs Time'!$A$15^2)*O147)/('Option vs Time'!$A$15*SQRT(O147))","v":2.8254390055970262},{"$f":"Q147-'Option vs Time'!$A$15*SQRT(O147)","v":0.737377694236653},0.99763920617916935,0.76955365186798985,7.1121921849837122E-2]
[null,null,null,110.000001,{"$f":"IF($C$4, 'Other Graphs'!$A$6*H148-EXP(-1*'Other Graphs'!$A$3*D148)*'Other Graphs'!$A$9*I148,-1*'Other Graphs'!$A$6*H148+EXP(-1*'Other Graphs'!$A$3*D148)*'Other Graphs'!$A$9*I148)","v":107.94845613560598},{"$f":"(LN('Other Graphs'!$A$6/'Other Graphs'!$A$9)+('Other Graphs'!$A$3+0.5*'Other Graphs'!$A$15^2)*D148)/('Other Graphs'!$A$15*SQRT(D148))","v":2.8842243455780272},{"$f":"F148-'Other Graphs'!$A$15*SQRT(D148)","v":0.78660663970309797},0.99803810445003083,0.78424391437713947,{"$f":"(F148*SQRT(D148)+SQRT(F148^2*D148-2*D148*LN('Other Graphs'!$A$6/'Other Graphs'!$A$9)-2*Data!D148^2*'Other Graphs'!$A$3))/D148","v":0.34999999999999992},{"$f":"(F148*SQRT(D148)-SQRT(F148^2*D148-2*D148*LN('Other Graphs'!$A$6/'Other Graphs'!$A$9)-2*Data!D148^2*'Other Graphs'!$A$3))/D148","v":0.20000000000000007},null,null,null,110.000001,{"$f":"IF($C$4, 'Option vs Time'!$A$6*S148-EXP(-1*'Option vs Time'!$A$3*O148)*'Option vs Time'!$A$9*T148,-1*'Option vs Time'!$A$6*S148+EXP(-1*'Option vs Time'!$A$3*O148)*'Option vs Time'!$A$9*T148)","v":97.969530205030807},{"$f":"(LN('Option vs Time'!$A$6/'Option vs Time'!$A$9)+('Option vs Time'!$A$3+0.5*'Option vs Time'!$A$15^2)*O148)/('Option vs Time'!$A$15*SQRT(O148))","v":2.8387870003757136},{"$f":"Q148-'Option vs Time'!$A$15*SQRT(O148)","v":0.74116929450078439},0.9977357312720555,0.77070460074048608,6.8719156595179243E-2]
[null,null,null,111.000001,{"$f":"IF($C$4, 'Other Graphs'!$A$6*H149-EXP(-1*'Other Graphs'!$A$3*D149)*'Other Graphs'!$A$9*I149,-1*'Other Graphs'!$A$6*H149+EXP(-1*'Other Graphs'!$A$3*D149)*'Other Graphs'!$A$9*I149)","v":108.01803537098291},{"$f":"(LN('Other Graphs'!$A$6/'Other Graphs'!$A$9)+('Other Graphs'!$A$3+0.5*'Other Graphs'!$A$15^2)*D149)/('Other Graphs'!$A$15*SQRT(D149))","v":2.8973047950854252},{"$f":"F149-'Other Graphs'!$A$15*SQRT(D149)","v":0.79017403502329708},0.99811808056289941,0.78528693122735471,{"$f":"(F149*SQRT(D149)+SQRT(F149^2*D149-2*D149*LN('Other Graphs'!$A$6/'Other Graphs'!$A$9)-2*Data!D149^2*'Other Graphs'!$A$3))/D149","v":0.34999999999999981},{"$f":"(F149*SQRT(D149)-SQRT(F149^2*D149-2*D149*LN('Other Graphs'!$A$6/'Other Graphs'!$A$9)-2*Data!D149^2*'Other Graphs'!$A$3))/D149","v":0.20000000000000012},null,null,null,111.000001,{"$f":"IF($C$4, 'Option vs Time'!$A$6*S149-EXP(-1*'Option vs Time'!$A$3*O149)*'Option vs Time'!$A$9*T149,-1*'Option vs Time'!$A$6*S149+EXP(-1*'Option vs Time'!$A$3*O149)*'Option vs Time'!$A$9*T149)","v":98.038249361625986},{"$f":"(LN('Option vs Time'!$A$6/'Option vs Time'!$A$9)+('Option vs Time'!$A$3+0.5*'Option vs Time'!$A$15^2)*O149)/('Option vs Time'!$A$15*SQRT(O149))","v":2.8520725856702325},{"$f":"Q149-'Option vs Time'!$A$15*SQRT(O149)","v":0.7449418256081044},0.99782824094550626,0.77184655559212101,6.6397449326004221E-2]
[null,null,null,112.000001,{"$f":"IF($C$4, 'Other Graphs'!$A$6*H150-EXP(-1*'Other Graphs'!$A$3*D150)*'Other Graphs'!$A$9*I150,-1*'Other Graphs'!$A$6*H150+EXP(-1*'Other Graphs'!$A$3*D150)*'Other Graphs'!$A$9*I150)","v":108.08525720700173},{"$f":"(LN('Other Graphs'!$A$6/'Other Graphs'!$A$9)+('Other Graphs'!$A$3+0.5*'Other Graphs'!$A$15^2)*D150)/('Other Graphs'!$A$15*SQRT(D150))","v":2.9103264551635784},{"$f":"F150-'Other Graphs'!$A$15*SQRT(D150)","v":0.79372539686279397},0.99819474291888799,0.78632234408273938,{"$f":"(F150*SQRT(D150)+SQRT(F150^2*D150-2*D150*LN('Other Graphs'!$A$6/'Other Graphs'!$A$9)-2*Data!D150^2*'Other Graphs'!$A$3))/D150","v":0.35},{"$f":"(F150*SQRT(D150)-SQRT(F150^2*D150-2*D150*LN('Other Graphs'!$A$6/'Other Graphs'!$A$9)-2*Data!D150^2*'Other Graphs'!$A$3))/D150","v":0.20000000000000004},null,null,null,112.000001,{"$f":"IF($C$4, 'Option vs Time'!$A$6*S150-EXP(-1*'Option vs Time'!$A$3*O150)*'Option vs Time'!$A$9*T150,-1*'Option vs Time'!$A$6*S150+EXP(-1*'Option vs Time'!$A$3*O150)*'Option vs Time'!$A$9*T150)","v":98.104646810951991},{"$f":"(LN('Option vs Time'!$A$6/'Option vs Time'!$A$9)+('Option vs Time'!$A$3+0.5*'Option vs Time'!$A$15^2)*O150)/('Option vs Time'!$A$15*SQRT(O150))","v":2.865296628011909},{"$f":"Q150-'Option vs Time'!$A$15*SQRT(O150)","v":0.74869556971112461},0.99791690607873718,0.77297964273548103,6.4154066706976209E-2]
[null,null,null,113.000001,{"$f":"IF($C$4, 'Other Graphs'!$A$6*H151-EXP(-1*'Other Graphs'!$A$3*D151)*'Other Graphs'!$A$9*I151,-1*'Other Graphs'!$A$6*H151+EXP(-1*'Other Graphs'!$A$3*D151)*'Other Graphs'!$A$9*I151)","v":108.15020148220758},{"$f":"(LN('Other Graphs'!$A$6/'Other Graphs'!$A$9)+('Other Graphs'!$A$3+0.5*'Other Graphs'!$A$15^2)*D151)/('Other Graphs'!$A$15*SQRT(D151))","v":2.9232901114369412},{"$f":"F151-'Other Graphs'!$A$15*SQRT(D151)","v":0.79726093948280274},0.99826823177719104,0.78735024972188805,{"$f":"(F151*SQRT(D151)+SQRT(F151^2*D151-2*D151*LN('Other Graphs'!$A$6/'Other Graphs'!$A$9)-2*Data!D151^2*'Other Graphs'!$A$3))/D151","v":0.35000000000000031},{"$f":"(F151*SQRT(D151)-SQRT(F151^2*D151-2*D151*LN('Other Graphs'!$A$6/'Other Graphs'!$A$9)-2*Data!D151^2*'Other Graphs'!$A$3))/D151","v":0.19999999999999982},null,null,null,113.000001,{"$f":"IF($C$4, 'Option vs Time'!$A$6*S151-EXP(-1*'Option vs Time'!$A$3*O151)*'Option vs Time'!$A$9*T151,-1*'Option vs Time'!$A$6*S151+EXP(-1*'Option vs Time'!$A$3*O151)*'Option vs Time'!$A$9*T151)","v":98.168800877658967},{"$f":"(LN('Option vs Time'!$A$6/'Option vs Time'!$A$9)+('Option vs Time'!$A$3+0.5*'Option vs Time'!$A$15^2)*O151)/('Option vs Time'!$A$15*SQRT(O151))","v":2.8784599740796439},{"$f":"Q151-'Option vs Time'!$A$15*SQRT(O151)","v":0.7524308021255055},0.99800189005610429,0.77410398555849302,6.1986367783248397E-2]
[null,null,null,114.000001,{"$f":"IF($C$4, 'Other Graphs'!$A$6*H152-EXP(-1*'Other Graphs'!$A$3*D152)*'Other Graphs'!$A$9*I152,-1*'Other Graphs'!$A$6*H152+EXP(-1*'Other Graphs'!$A$3*D152)*'Other Graphs'!$A$9*I152)","v":108.21294532809134},{"$f":"(LN('Other Graphs'!$A$6/'Other Graphs'!$A$9)+('Other Graphs'!$A$3+0.5*'Other Graphs'!$A$15^2)*D152)/('Other Graphs'!$A$15*SQRT(D152))","v":2.9361965321866657},{"$f":"F152-'Other Graphs'!$A$15*SQRT(D152)","v":0.8007808724145451},0.99833868129069081,0.78837074289348508,{"$f":"(F152*SQRT(D152)+SQRT(F152^2*D152-2*D152*LN('Other Graphs'!$A$6/'Other Graphs'!$A$9)-2*Data!D152^2*'Other Graphs'!$A$3))/D152","v":0.35000000000000009},{"$f":"(F152*SQRT(D152)-SQRT(F152^2*D152-2*D152*LN('Other Graphs'!$A$6/'Other Graphs'!$A$9)-2*Data!D152^2*'Other Graphs'!$A$3))/D152","v":0.2},null,null,null,114.000001,{"$f":"IF($C$4, 'Option vs Time'!$A$6*S152-EXP(-1*'Option vs Time'!$A$3*O152)*'Option vs Time'!$A$9*T152,-1*'Option vs Time'!$A$6*S152+EXP(-1*'Option vs Time'!$A$3*O152)*'Option vs Time'!$A$9*T152)","v":98.230787245442215},{"$f":"(LN('Option vs Time'!$A$6/'Option vs Time'!$A$9)+('Option vs Time'!$A$3+0.5*'Option vs Time'!$A$15^2)*O152)/('Option vs Time'!$A$15*SQRT(O152))","v":2.8915634513304092},{"$f":"Q152-'Option vs Time'!$A$15*SQRT(O152)","v":0.7561477915582886},0.99808334910935526,0.77521970462010237,5.989180082993073E-2]
[null,null,null,115.000001,{"$f":"IF($C$4, 'Other Graphs'!$A$6*H153-EXP(-1*'Other Graphs'!$A$3*D153)*'Other Graphs'!$A$9*I153,-1*'Other Graphs'!$A$6*H153+EXP(-1*'Other Graphs'!$A$3*D153)*'Other Graphs'!$A$9*I153)","v":108.273563261319},{"$f":"(LN('Other Graphs'!$A$6/'Other Graphs'!$A$9)+('Other Graphs'!$A$3+0.5*'Other Graphs'!$A$15^2)*D153)/('Other Graphs'!$A$15*SQRT(D153))","v":2.9490464688819338},{"$f":"F153-'Other Graphs'!$A$15*SQRT(D153)","v":0.8042854006041642},0.9984062197819541,0.78938391637703487,{"$f":"(F153*SQRT(D153)+SQRT(F153^2*D153-2*D153*LN('Other Graphs'!$A$6/'Other Graphs'!$A$9)-2*Data!D153^2*'Other Graphs'!$A$3))/D153","v":0.35000000000000014},{"$f":"(F153*SQRT(D153)-SQRT(F153^2*D153-2*D153*LN('Other Graphs'!$A$6/'Other Graphs'!$A$9)-2*Data!D153^2*'Other Graphs'!$A$3))/D153","v":0.19999999999999996},null,null,null,115.000001,{"$f":"IF($C$4, 'Option vs Time'!$A$6*S153-EXP(-1*'Option vs Time'!$A$3*O153)*'Option vs Time'!$A$9*T153,-1*'Option vs Time'!$A$6*S153+EXP(-1*'Option vs Time'!$A$3*O153)*'Option vs Time'!$A$9*T153)","v":98.290679046272146},{"$f":"(LN('Option vs Time'!$A$6/'Option vs Time'!$A$9)+('Option vs Time'!$A$3+0.5*'Option vs Time'!$A$15^2)*O153)/('Option vs Time'!$A$15*SQRT(O153))","v":2.9046078686042542},{"$f":"Q153-'Option vs Time'!$A$15*SQRT(O153)","v":0.75984680032648466},0.9981614326433943,0.77632691774194929,5.7867900311862286E-2]
[null,null,null,116.000001,{"$f":"IF($C$4, 'Other Graphs'!$A$6*H154-EXP(-1*'Other Graphs'!$A$3*D154)*'Other Graphs'!$A$9*I154,-1*'Other Graphs'!$A$6*H154+EXP(-1*'Other Graphs'!$A$3*D154)*'Other Graphs'!$A$9*I154)","v":108.33212727277774},{"$f":"(LN('Other Graphs'!$A$6/'Other Graphs'!$A$9)+('Other Graphs'!$A$3+0.5*'Other Graphs'!$A$15^2)*D154)/('Other Graphs'!$A$15*SQRT(D154))","v":2.9618406566905318},{"$f":"F154-'Other Graphs'!$A$15*SQRT(D154)","v":0.80777472455196309},0.99847097000612128,0.79038986104124087,{"$f":"(F154*SQRT(D154)+SQRT(F154^2*D154-2*D154*LN('Other Graphs'!$A$6/'Other Graphs'!$A$9)-2*Data!D154^2*'Other Graphs'!$A$3))/D154","v":0.35000000000000003},{"$f":"(F154*SQRT(D154)-SQRT(F154^2*D154-2*D154*LN('Other Graphs'!$A$6/'Other Graphs'!$A$9)-2*Data!D154^2*'Other Graphs'!$A$3))/D154","v":0.20000000000000004},null,null,null,116.000001,{"$f":"IF($C$4, 'Option vs Time'!$A$6*S154-EXP(-1*'Option vs Time'!$A$3*O154)*'Option vs Time'!$A$9*T154,-1*'Option vs Time'!$A$6*S154+EXP(-1*'Option vs Time'!$A$3*O154)*'Option vs Time'!$A$9*T154)","v":98.348546946584008},{"$f":"(LN('Option vs Time'!$A$6/'Option vs Time'!$A$9)+('Option vs Time'!$A$3+0.5*'Option vs Time'!$A$15^2)*O154)/('Option vs Time'!$A$15*SQRT(O154))","v":2.9175940167050509},{"$f":"Q154-'Option vs Time'!$A$15*SQRT(O154)","v":0.76352808456648225},0.99823628354641203,0.77742574009623588,5.5912283949126618E-2]
[null,null,null,117.000001,{"$f":"IF($C$4, 'Other Graphs'!$A$6*H155-EXP(-1*'Other Graphs'!$A$3*D155)*'Other Graphs'!$A$9*I155,-1*'Other Graphs'!$A$6*H155+EXP(-1*'Other Graphs'!$A$3*D155)*'Other Graphs'!$A$9*I155)","v":108.38870691355156},{"$f":"(LN('Other Graphs'!$A$6/'Other Graphs'!$A$9)+('Other Graphs'!$A$3+0.5*'Other Graphs'!$A$15^2)*D155)/('Other Graphs'!$A$15*SQRT(D155))","v":2.9745798149696712},{"$f":"F155-'Other Graphs'!$A$15*SQRT(D155)","v":0.81124904044627444},0.99853304940134857,0.7913886659001601,{"$f":"(F155*SQRT(D155)+SQRT(F155^2*D155-2*D155*LN('Other Graphs'!$A$6/'Other Graphs'!$A$9)-2*Data!D155^2*'Other Graphs'!$A$3))/D155","v":0.35000000000000014},{"$f":"(F155*SQRT(D155)-SQRT(F155^2*D155-2*D155*LN('Other Graphs'!$A$6/'Other Graphs'!$A$9)-2*Data!D155^2*'Other Graphs'!$A$3))/D155","v":0.1999999999999999},null,null,null,117.000001,{"$f":"IF($C$4, 'Option vs Time'!$A$6*S155-EXP(-1*'Option vs Time'!$A$3*O155)*'Option vs Time'!$A$9*T155,-1*'Option vs Time'!$A$6*S155+EXP(-1*'Option vs Time'!$A$3*O155)*'Option vs Time'!$A$9*T155)","v":98.404459230533135},{"$f":"(LN('Option vs Time'!$A$6/'Option vs Time'!$A$9)+('Option vs Time'!$A$3+0.5*'Option vs Time'!$A$15^2)*O155)/('Option vs Time'!$A$15*SQRT(O155))","v":2.930522668958182},{"$f":"Q155-'Option vs Time'!$A$15*SQRT(O155)","v":0.7671918944347853},0.99830803848518224,0.7785162842899902,5.4022649885055785E-2]
[null,null,null,118.000001,{"$f":"IF($C$4, 'Other Graphs'!$A$6*H156-EXP(-1*'Other Graphs'!$A$3*D156)*'Other Graphs'!$A$9*I156,-1*'Other Graphs'!$A$6*H156+EXP(-1*'Other Graphs'!$A$3*D156)*'Other Graphs'!$A$9*I156)","v":108.44336937793585},{"$f":"(LN('Other Graphs'!$A$6/'Other Graphs'!$A$9)+('Other Graphs'!$A$3+0.5*'Other Graphs'!$A$15^2)*D156)/('Other Graphs'!$A$15*SQRT(D156))","v":2.9872646477379603},{"$f":"F156-'Other Graphs'!$A$15*SQRT(D156)","v":0.81470854029217099},0.99859257032743343,0.79238041816722082,{"$f":"(F156*SQRT(D156)+SQRT(F156^2*D156-2*D156*LN('Other Graphs'!$A$6/'Other Graphs'!$A$9)-2*Data!D156^2*'Other Graphs'!$A$3))/D156","v":0.35},{"$f":"(F156*SQRT(D156)-SQRT(F156^2*D156-2*D156*LN('Other Graphs'!$A$6/'Other Graphs'!$A$9)-2*Data!D156^2*'Other Graphs'!$A$3))/D156","v":0.20000000000000004},null,null,null,118.000001,{"$f":"IF($C$4, 'Option vs Time'!$A$6*S156-EXP(-1*'Option vs Time'!$A$3*O156)*'Option vs Time'!$A$9*T156,-1*'Option vs Time'!$A$6*S156+EXP(-1*'Option vs Time'!$A$3*O156)*'Option vs Time'!$A$9*T156)","v":98.458481880418191},{"$f":"(LN('Option vs Time'!$A$6/'Option vs Time'!$A$9)+('Option vs Time'!$A$3+0.5*'Option vs Time'!$A$15^2)*O156)/('Option vs Time'!$A$15*SQRT(O156))","v":2.943394581746257},{"$f":"Q156-'Option vs Time'!$A$15*SQRT(O156)","v":0.7708384743004677},0.99837682818628548,0.77959866044589066,5.2196773952587705E-2]
[null,null,null,119.000001,{"$f":"IF($C$4, 'Other Graphs'!$A$6*H157-EXP(-1*'Other Graphs'!$A$3*D157)*'Other Graphs'!$A$9*I157,-1*'Other Graphs'!$A$6*H157+EXP(-1*'Other Graphs'!$A$3*D157)*'Other Graphs'!$A$9*I157)","v":108.49617958359578},{"$f":"(LN('Other Graphs'!$A$6/'Other Graphs'!$A$9)+('Other Graphs'!$A$3+0.5*'Other Graphs'!$A$15^2)*D157)/('Other Graphs'!$A$15*SQRT(D157))","v":2.9998958441294263},{"$f":"F157-'Other Graphs'!$A$15*SQRT(D157)","v":0.81815341203529846},0.99864964029321568,0.79336520330721716,{"$f":"(F157*SQRT(D157)+SQRT(F157^2*D157-2*D157*LN('Other Graphs'!$A$6/'Other Graphs'!$A$9)-2*Data!D157^2*'Other Graphs'!$A$3))/D157","v":0.3500000000000002},{"$f":"(F157*SQRT(D157)-SQRT(F157^2*D157-2*D157*LN('Other Graphs'!$A$6/'Other Graphs'!$A$9)-2*Data!D157^2*'Other Graphs'!$A$3))/D157","v":0.19999999999999993},null,null,null,119.000001,{"$f":"IF($C$4, 'Option vs Time'!$A$6*S157-EXP(-1*'Option vs Time'!$A$3*O157)*'Option vs Time'!$A$9*T157,-1*'Option vs Time'!$A$6*S157+EXP(-1*'Option vs Time'!$A$3*O157)*'Option vs Time'!$A$9*T157)","v":98.510678654370778},{"$f":"(LN('Option vs Time'!$A$6/'Option vs Time'!$A$9)+('Option vs Time'!$A$3+0.5*'Option vs Time'!$A$15^2)*O157)/('Option vs Time'!$A$15*SQRT(O157))","v":2.9562104950239214},{"$f":"Q157-'Option vs Time'!$A$15*SQRT(O157)","v":0.77446806292979353},0.99844277770397494,0.78067297627983434,5.0432507035026219E-2]
[null,null,null,120.000001,{"$f":"IF($C$4, 'Other Graphs'!$A$6*H158-EXP(-1*'Other Graphs'!$A$3*D158)*'Other Graphs'!$A$9*I158,-1*'Other Graphs'!$A$6*H158+EXP(-1*'Other Graphs'!$A$3*D158)*'Other Graphs'!$A$9*I158)","v":108.54720024896909},{"$f":"(LN('Other Graphs'!$A$6/'Other Graphs'!$A$9)+('Other Graphs'!$A$3+0.5*'Other Graphs'!$A$15^2)*D158)/('Other Graphs'!$A$15*SQRT(D158))","v":3.0124740788303894},{"$f":"F158-'Other Graphs'!$A$15*SQRT(D158)","v":0.82158383968101578},0.99870436217331471,0.7943431050863583,{"$f":"(F158*SQRT(D158)+SQRT(F158^2*D158-2*D158*LN('Other Graphs'!$A$6/'Other Graphs'!$A$9)-2*Data!D158^2*'Other Graphs'!$A$3))/D158","v":0.3500000000000002},{"$f":"(F158*SQRT(D158)-SQRT(F158^2*D158-2*D158*LN('Other Graphs'!$A$6/'Other Graphs'!$A$9)-2*Data!D158^2*'Other Graphs'!$A$3))/D158","v":0.1999999999999999},null,null,null,120.000001,{"$f":"IF($C$4, 'Option vs Time'!$A$6*S158-EXP(-1*'Option vs Time'!$A$3*O158)*'Option vs Time'!$A$9*T158,-1*'Option vs Time'!$A$6*S158+EXP(-1*'Option vs Time'!$A$3*O158)*'Option vs Time'!$A$9*T158)","v":98.561111161405805},{"$f":"(LN('Option vs Time'!$A$6/'Option vs Time'!$A$9)+('Option vs Time'!$A$3+0.5*'Option vs Time'!$A$15^2)*O158)/('Option vs Time'!$A$15*SQRT(O158))","v":2.9689711328127331},{"$f":"Q158-'Option vs Time'!$A$15*SQRT(O158)","v":0.77808089366335942},0.99850600667535994,0.78173933717539712,4.8727772518759593E-2]
[null,null,null,121.000001,{"$f":"IF($C$4, 'Other Graphs'!$A$6*H159-EXP(-1*'Other Graphs'!$A$3*D159)*'Other Graphs'!$A$9*I159,-1*'Other Graphs'!$A$6*H159+EXP(-1*'Other Graphs'!$A$3*D159)*'Other Graphs'!$A$9*I159)","v":108.59649196801122},{"$f":"(LN('Other Graphs'!$A$6/'Other Graphs'!$A$9)+('Other Graphs'!$A$3+0.5*'Other Graphs'!$A$15^2)*D159)/('Other Graphs'!$A$15*SQRT(D159))","v":3.0250000125000001},{"$f":"F159-'Other Graphs'!$A$15*SQRT(D159)","v":0.82500000340909097},0.99875683441473584,0.79531420562047428,{"$f":"(F159*SQRT(D159)+SQRT(F159^2*D159-2*D159*LN('Other Graphs'!$A$6/'Other Graphs'!$A$9)-2*Data!D159^2*'Other Graphs'!$A$3))/D159","v":0.35},{"$f":"(F159*SQRT(D159)-SQRT(F159^2*D159-2*D159*LN('Other Graphs'!$A$6/'Other Graphs'!$A$9)-2*Data!D159^2*'Other Graphs'!$A$3))/D159","v":0.19999999999999998},null,null,null,121.000001,{"$f":"IF($C$4, 'Option vs Time'!$A$6*S159-EXP(-1*'Option vs Time'!$A$3*O159)*'Option vs Time'!$A$9*T159,-1*'Option vs Time'!$A$6*S159+EXP(-1*'Option vs Time'!$A$3*O159)*'Option vs Time'!$A$9*T159)","v":98.609838933924564},{"$f":"(LN('Option vs Time'!$A$6/'Option vs Time'!$A$9)+('Option vs Time'!$A$3+0.5*'Option vs Time'!$A$15^2)*O159)/('Option vs Time'!$A$15*SQRT(O159))","v":2.9816772036770542},{"$f":"Q159-'Option vs Time'!$A$15*SQRT(O159)","v":0.78167719458614515},0.99856662956354902,0.78279784625534465,4.7080563833517886E-2]
[null,null,null,122.000001,{"$f":"IF($C$4, 'Other Graphs'!$A$6*H160-EXP(-1*'Other Graphs'!$A$3*D160)*'Other Graphs'!$A$9*I160,-1*'Other Graphs'!$A$6*H160+EXP(-1*'Other Graphs'!$A$3*D160)*'Other Graphs'!$A$9*I160)","v":108.6441132823755},{"$f":"(LN('Other Graphs'!$A$6/'Other Graphs'!$A$9)+('Other Graphs'!$A$3+0.5*'Other Graphs'!$A$15^2)*D160)/('Other Graphs'!$A$15*SQRT(D160))","v":3.0374742921751618},{"$f":"F160-'Other Graphs'!$A$15*SQRT(D160)","v":0.82840207968413493},0.99880715123384545,0.79627858542145136,{"$f":"(F160*SQRT(D160)+SQRT(F160^2*D160-2*D160*LN('Other Graphs'!$A$6/'Other Graphs'!$A$9)-2*Data!D160^2*'Other Graphs'!$A$3))/D160","v":0.35},{"$f":"(F160*SQRT(D160)-SQRT(F160^2*D160-2*D160*LN('Other Graphs'!$A$6/'Other Graphs'!$A$9)-2*Data!D160^2*'Other Graphs'!$A$3))/D160","v":0.20000000000000007},null,null,null,122.000001,{"$f":"IF($C$4, 'Option vs Time'!$A$6*S160-EXP(-1*'Option vs Time'!$A$3*O160)*'Option vs Time'!$A$9*T160,-1*'Option vs Time'!$A$6*S160+EXP(-1*'Option vs Time'!$A$3*O160)*'Option vs Time'!$A$9*T160)","v":98.656919497758082},{"$f":"(LN('Option vs Time'!$A$6/'Option vs Time'!$A$9)+('Option vs Time'!$A$3+0.5*'Option vs Time'!$A$15^2)*O160)/('Option vs Time'!$A$15*SQRT(O160))","v":2.9943294011818296},{"$f":"Q160-'Option vs Time'!$A$15*SQRT(O160)","v":0.78525718869080263},0.99862475588935473,0.78384860445033067,4.5488942077639649E-2]
[null,null,null,123.000001,{"$f":"IF($C$4, 'Other Graphs'!$A$6*H161-EXP(-1*'Other Graphs'!$A$3*D161)*'Other Graphs'!$A$9*I161,-1*'Other Graphs'!$A$6*H161+EXP(-1*'Other Graphs'!$A$3*D161)*'Other Graphs'!$A$9*I161)","v":108.69012075111893},{"$f":"(LN('Other Graphs'!$A$6/'Other Graphs'!$A$9)+('Other Graphs'!$A$3+0.5*'Other Graphs'!$A$15^2)*D161)/('Other Graphs'!$A$15*SQRT(D161))","v":3.0498975516605471},{"$f":"F161-'Other Graphs'!$A$15*SQRT(D161)","v":0.83179024136196711},0.99885540280419238,0.79723632344198125,{"$f":"(F161*SQRT(D161)+SQRT(F161^2*D161-2*D161*LN('Other Graphs'!$A$6/'Other Graphs'!$A$9)-2*Data!D161^2*'Other Graphs'!$A$3))/D161","v":0.35000000000000003},{"$f":"(F161*SQRT(D161)-SQRT(F161^2*D161-2*D161*LN('Other Graphs'!$A$6/'Other Graphs'!$A$9)-2*Data!D161^2*'Other Graphs'!$A$3))/D161","v":0.19999999999999998},null,null,null,123.000001,{"$f":"IF($C$4, 'Option vs Time'!$A$6*S161-EXP(-1*'Option vs Time'!$A$3*O161)*'Option vs Time'!$A$9*T161,-1*'Option vs Time'!$A$6*S161+EXP(-1*'Option vs Time'!$A$3*O161)*'Option vs Time'!$A$9*T161)","v":98.702408439835722},{"$f":"(LN('Option vs Time'!$A$6/'Option vs Time'!$A$9)+('Option vs Time'!$A$3+0.5*'Option vs Time'!$A$15^2)*O161)/('Option vs Time'!$A$15*SQRT(O161))","v":3.0069284043330922},{"$f":"Q161-'Option vs Time'!$A$15*SQRT(O161)","v":0.78882109403451217},0.99868049045213392,0.78489171056491913,4.3951033725178945E-2]
[null,null,null,124.000001,{"$f":"IF($C$4, 'Other Graphs'!$A$6*H162-EXP(-1*'Other Graphs'!$A$3*D162)*'Other Graphs'!$A$9*I162,-1*'Other Graphs'!$A$6*H162+EXP(-1*'Other Graphs'!$A$3*D162)*'Other Graphs'!$A$9*I162)","v":108.73456901802027},{"$f":"(LN('Other Graphs'!$A$6/'Other Graphs'!$A$9)+('Other Graphs'!$A$3+0.5*'Other Graphs'!$A$15^2)*D162)/('Other Graphs'!$A$15*SQRT(D162))","v":3.0622704119043767},{"$f":"F162-'Other Graphs'!$A$15*SQRT(D162)","v":0.8351646577921028},0.99890167543562591,0.79818749711869696,{"$f":"(F162*SQRT(D162)+SQRT(F162^2*D162-2*D162*LN('Other Graphs'!$A$6/'Other Graphs'!$A$9)-2*Data!D162^2*'Other Graphs'!$A$3))/D162","v":0.35},{"$f":"(F162*SQRT(D162)-SQRT(F162^2*D162-2*D162*LN('Other Graphs'!$A$6/'Other Graphs'!$A$9)-2*Data!D162^2*'Other Graphs'!$A$3))/D162","v":0.2},null,null,null,124.000001,{"$f":"IF($C$4, 'Option vs Time'!$A$6*S162-EXP(-1*'Option vs Time'!$A$3*O162)*'Option vs Time'!$A$9*T162,-1*'Option vs Time'!$A$6*S162+EXP(-1*'Option vs Time'!$A$3*O162)*'Option vs Time'!$A$9*T162)","v":98.746359473560901},{"$f":"(LN('Option vs Time'!$A$6/'Option vs Time'!$A$9)+('Option vs Time'!$A$3+0.5*'Option vs Time'!$A$15^2)*O162)/('Option vs Time'!$A$15*SQRT(O162))","v":3.0194748780019842},{"$f":"Q162-'Option vs Time'!$A$15*SQRT(O162)","v":0.79236912388971037},0.99873393354030271,0.78592726134105506,4.2465028411953654E-2]
[null,null,null,125.000001,{"$f":"IF($C$4, 'Other Graphs'!$A$6*H163-EXP(-1*'Other Graphs'!$A$3*D163)*'Other Graphs'!$A$9*I163,-1*'Other Graphs'!$A$6*H163+EXP(-1*'Other Graphs'!$A$3*D163)*'Other Graphs'!$A$9*I163)","v":108.77751087659389},{"$f":"(LN('Other Graphs'!$A$6/'Other Graphs'!$A$9)+('Other Graphs'!$A$3+0.5*'Other Graphs'!$A$15^2)*D163)/('Other Graphs'!$A$15*SQRT(D163))","v":3.0745934813605849},{"$f":"F163-'Other Graphs'!$A$15*SQRT(D163)","v":0.83852549491652306},0.99894605174513551,0.79913218241376716,{"$f":"(F163*SQRT(D163)+SQRT(F163^2*D163-2*D163*LN('Other Graphs'!$A$6/'Other Graphs'!$A$9)-2*Data!D163^2*'Other Graphs'!$A$3))/D163","v":0.35000000000000009},{"$f":"(F163*SQRT(D163)-SQRT(F163^2*D163-2*D163*LN('Other Graphs'!$A$6/'Other Graphs'!$A$9)-2*Data!D163^2*'Other Graphs'!$A$3))/D163","v":0.2},null,null,null,125.000001,{"$f":"IF($C$4, 'Option vs Time'!$A$6*S163-EXP(-1*'Option vs Time'!$A$3*O163)*'Option vs Time'!$A$9*T163,-1*'Option vs Time'!$A$6*S163+EXP(-1*'Option vs Time'!$A$3*O163)*'Option vs Time'!$A$9*T163)","v":98.788824501972854},{"$f":"(LN('Option vs Time'!$A$6/'Option vs Time'!$A$9)+('Option vs Time'!$A$3+0.5*'Option vs Time'!$A$15^2)*O163)/('Option vs Time'!$A$15*SQRT(O163))","v":3.0319694733330413},{"$f":"Q163-'Option vs Time'!$A$15*SQRT(O163)","v":0.79590148688897955},0.99878518113203973,0.78695535151910456,4.102917679732343E-2]
[null,null,null,126.000001,{"$f":"IF($C$4, 'Other Graphs'!$A$6*H164-EXP(-1*'Other Graphs'!$A$3*D164)*'Other Graphs'!$A$9*I164,-1*'Other Graphs'!$A$6*H164+EXP(-1*'Other Graphs'!$A$3*D164)*'Other Graphs'!$A$9*I164)","v":108.81899733287973},{"$f":"(LN('Other Graphs'!$A$6/'Other Graphs'!$A$9)+('Other Graphs'!$A$3+0.5*'Other Graphs'!$A$15^2)*D164)/('Other Graphs'!$A$15*SQRT(D164))","v":3.0868673563379754},{"$f":"F164-'Other Graphs'!$A$15*SQRT(D164)","v":0.8418729153649025},0.99898861081981727,0.80007045385501563,{"$f":"(F164*SQRT(D164)+SQRT(F164^2*D164-2*D164*LN('Other Graphs'!$A$6/'Other Graphs'!$A$9)-2*Data!D164^2*'Other Graphs'!$A$3))/D164","v":0.35000000000000014},{"$f":"(F164*SQRT(D164)-SQRT(F164^2*D164-2*D164*LN('Other Graphs'!$A$6/'Other Graphs'!$A$9)-2*Data!D164^2*'Other Graphs'!$A$3))/D164","v":0.19999999999999993},null,null,null,126.000001,{"$f":"IF($C$4, 'Option vs Time'!$A$6*S164-EXP(-1*'Option vs Time'!$A$3*O164)*'Option vs Time'!$A$9*T164,-1*'Option vs Time'!$A$6*S164+EXP(-1*'Option vs Time'!$A$3*O164)*'Option vs Time'!$A$9*T164)","v":98.829853678770178},{"$f":"(LN('Option vs Time'!$A$6/'Option vs Time'!$A$9)+('Option vs Time'!$A$3+0.5*'Option vs Time'!$A$15^2)*O164)/('Option vs Time'!$A$15*SQRT(O164))","v":3.0444128281374452},{"$f":"Q164-'Option vs Time'!$A$15*SQRT(O164)","v":0.7994183871643723},0.99883432508666015,0.78797607389657753,3.9641788499565678E-2]
[null,null,null,127.000001,{"$f":"IF($C$4, 'Other Graphs'!$A$6*H165-EXP(-1*'Other Graphs'!$A$3*D165)*'Other Graphs'!$A$9*I165,-1*'Other Graphs'!$A$6*H165+EXP(-1*'Other Graphs'!$A$3*D165)*'Other Graphs'!$A$9*I165)","v":108.85907766608722},{"$f":"(LN('Other Graphs'!$A$6/'Other Graphs'!$A$9)+('Other Graphs'!$A$3+0.5*'Other Graphs'!$A$15^2)*D165)/('Other Graphs'!$A$15*SQRT(D165))","v":3.0990926213369292},{"$f":"F165-'Other Graphs'!$A$15*SQRT(D165)","v":0.84520707854643495},0.99902942837235054,0.80100238457462858,{"$f":"(F165*SQRT(D165)+SQRT(F165^2*D165-2*D165*LN('Other Graphs'!$A$6/'Other Graphs'!$A$9)-2*Data!D165^2*'Other Graphs'!$A$3))/D165","v":0.34999999999999987},{"$f":"(F165*SQRT(D165)-SQRT(F165^2*D165-2*D165*LN('Other Graphs'!$A$6/'Other Graphs'!$A$9)-2*Data!D165^2*'Other Graphs'!$A$3))/D165","v":0.20000000000000018},null,null,null,127.000001,{"$f":"IF($C$4, 'Option vs Time'!$A$6*S165-EXP(-1*'Option vs Time'!$A$3*O165)*'Option vs Time'!$A$9*T165,-1*'Option vs Time'!$A$6*S165+EXP(-1*'Option vs Time'!$A$3*O165)*'Option vs Time'!$A$9*T165)","v":98.869495467269743},{"$f":"(LN('Option vs Time'!$A$6/'Option vs Time'!$A$9)+('Option vs Time'!$A$3+0.5*'Option vs Time'!$A$15^2)*O165)/('Option vs Time'!$A$15*SQRT(O165))","v":3.0568055672719199},{"$f":"Q165-'Option vs Time'!$A$15*SQRT(O165)","v":0.80292002448142563},0.99888145332712164,0.78898951938463691,3.8301230102078421E-2]
[null,null,null,128.000001,{"$f":"IF($C$4, 'Other Graphs'!$A$6*H166-EXP(-1*'Other Graphs'!$A$3*D166)*'Other Graphs'!$A$9*I166,-1*'Other Graphs'!$A$6*H166+EXP(-1*'Other Graphs'!$A$3*D166)*'Other Graphs'!$A$9*I166)","v":108.89779948716752},{"$f":"(LN('Other Graphs'!$A$6/'Other Graphs'!$A$9)+('Other Graphs'!$A$3+0.5*'Other Graphs'!$A$15^2)*D166)/('Other Graphs'!$A$15*SQRT(D166))","v":3.111269849374207},{"$f":"F166-'Other Graphs'!$A$15*SQRT(D166)","v":0.84852814073841998},0.99906857688934647,0.80192804634651382,{"$f":"(F166*SQRT(D166)+SQRT(F166^2*D166-2*D166*LN('Other Graphs'!$A$6/'Other Graphs'!$A$9)-2*Data!D166^2*'Other Graphs'!$A$3))/D166","v":0.35000000000000003},{"$f":"(F166*SQRT(D166)-SQRT(F166^2*D166-2*D166*LN('Other Graphs'!$A$6/'Other Graphs'!$A$9)-2*Data!D166^2*'Other Graphs'!$A$3))/D166","v":0.19999999999999998},null,null,null,128.000001,{"$f":"IF($C$4, 'Option vs Time'!$A$6*S166-EXP(-1*'Option vs Time'!$A$3*O166)*'Option vs Time'!$A$9*T166,-1*'Option vs Time'!$A$6*S166+EXP(-1*'Option vs Time'!$A$3*O166)*'Option vs Time'!$A$9*T166)","v":98.907796697371822},{"$f":"(LN('Option vs Time'!$A$6/'Option vs Time'!$A$9)+('Option vs Time'!$A$3+0.5*'Option vs Time'!$A$15^2)*O166)/('Option vs Time'!$A$15*SQRT(O166))","v":3.0691483030039022},{"$f":"Q166-'Option vs Time'!$A$15*SQRT(O166)","v":0.80640659436811513},0.99892665001409531,0.78999577706249946,3.7005923227525273E-2]
[null,null,null,129.000001,{"$f":"IF($C$4, 'Other Graphs'!$A$6*H167-EXP(-1*'Other Graphs'!$A$3*D167)*'Other Graphs'!$A$9*I167,-1*'Other Graphs'!$A$6*H167+EXP(-1*'Other Graphs'!$A$3*D167)*'Other Graphs'!$A$9*I167)","v":108.93520879538636},{"$f":"(LN('Other Graphs'!$A$6/'Other Graphs'!$A$9)+('Other Graphs'!$A$3+0.5*'Other Graphs'!$A$15^2)*D167)/('Other Graphs'!$A$15*SQRT(D167))","v":3.1233996022963502},{"$f":"F167-'Other Graphs'!$A$15*SQRT(D167)","v":0.85183625517173134},{"$f":"IF($C$4,NORMSDIST(F167),NORMSDIST(-1*F167))","v":0.99910612577291336},{"$f":"IF($C$4,NORMSDIST(G167),NORMSDIST(-1*G167))","v":0.8028475096223634},{"$f":"(F167*SQRT(D167)+SQRT(F167^2*D167-2*D167*LN('Other Graphs'!$A$6/'Other Graphs'!$A$9)-2*Data!D167^2*'Other Graphs'!$A$3))/D167","v":0.34999999999999987},{"$f":"(F167*SQRT(D167)-SQRT(F167^2*D167-2*D167*LN('Other Graphs'!$A$6/'Other Graphs'!$A$9)-2*Data!D167^2*'Other Graphs'!$A$3))/D167","v":0.20000000000000012},null,null,null,129.000001,{"$f":"IF($C$4, 'Option vs Time'!$A$6*S167-EXP(-1*'Option vs Time'!$A$3*O167)*'Option vs Time'!$A$9*T167,-1*'Option vs Time'!$A$6*S167+EXP(-1*'Option vs Time'!$A$3*O167)*'Option vs Time'!$A$9*T167)","v":98.944802620599347},{"$f":"(LN('Option vs Time'!$A$6/'Option vs Time'!$A$9)+('Option vs Time'!$A$3+0.5*'Option vs Time'!$A$15^2)*O167)/('Option vs Time'!$A$15*SQRT(O167))","v":3.0814416353635901},{"$f":"Q167-'Option vs Time'!$A$15*SQRT(O167)","v":0.80987828823897123},{"$f":"IF($C$4,NORMSDIST(Q167),NORMSDIST(-1*Q167))","v":0.99896999571201328},{"$f":"IF($C$4,NORMSDIST(R167),NORMSDIST(-1*R167))","v":0.79099493422982037},{"$f":"(P168-P167)/(O168-O167)","v":3.5754342677918771E-2}]
[null,null,null,130.000001,{"$f":"IF($C$4, 'Other Graphs'!$A$6*H168-EXP(-1*'Other Graphs'!$A$3*D168)*'Other Graphs'!$A$9*I168,-1*'Other Graphs'!$A$6*H168+EXP(-1*'Other Graphs'!$A$3*D168)*'Other Graphs'!$A$9*I168)","v":108.97135003296668},{"$f":"(LN('Other Graphs'!$A$6/'Other Graphs'!$A$9)+('Other Graphs'!$A$3+0.5*'Other Graphs'!$A$15^2)*D168)/('Other Graphs'!$A$15*SQRT(D168))","v":3.1354824310821772},{"$f":"F168-'Other Graphs'!$A$15*SQRT(D168)","v":0.8551315721133208},0.99914214147576574,0.80376084356648103,{"$f":"(F168*SQRT(D168)+SQRT(F168^2*D168-2*D168*LN('Other Graphs'!$A$6/'Other Graphs'!$A$9)-2*Data!D168^2*'Other Graphs'!$A$3))/D168","v":0.35},{"$f":"(F168*SQRT(D168)-SQRT(F168^2*D168-2*D168*LN('Other Graphs'!$A$6/'Other Graphs'!$A$9)-2*Data!D168^2*'Other Graphs'!$A$3))/D168","v":0.19999999999999998},null,null,null,130.000001,{"$f":"IF($C$4, 'Option vs Time'!$A$6*S168-EXP(-1*'Option vs Time'!$A$3*O168)*'Option vs Time'!$A$9*T168,-1*'Option vs Time'!$A$6*S168+EXP(-1*'Option vs Time'!$A$3*O168)*'Option vs Time'!$A$9*T168)","v":98.980556963277266},{"$f":"(LN('Option vs Time'!$A$6/'Option vs Time'!$A$9)+('Option vs Time'!$A$3+0.5*'Option vs Time'!$A$15^2)*O168)/('Option vs Time'!$A$15*SQRT(O168))","v":3.0936861524834431},{"$f":"Q168-'Option vs Time'!$A$15*SQRT(O168)","v":0.81333529351458678},0.99901156754748466,0.79198707645715383,3.4545014638339921E-2]
[null,null,null,131.000001,{"$f":"IF($C$4, 'Other Graphs'!$A$6*H169-EXP(-1*'Other Graphs'!$A$3*D169)*'Other Graphs'!$A$9*I169,-1*'Other Graphs'!$A$6*H169+EXP(-1*'Other Graphs'!$A$3*D169)*'Other Graphs'!$A$9*I169)","v":109.00626613786821},{"$f":"(LN('Other Graphs'!$A$6/'Other Graphs'!$A$9)+('Other Graphs'!$A$3+0.5*'Other Graphs'!$A$15^2)*D169)/('Other Graphs'!$A$15*SQRT(D169))","v":3.1475188761348201},{"$f":"F169-'Other Graphs'!$A$15*SQRT(D169)","v":0.85841423894585978},0.99917668763018552,0.80466811608942068,{"$f":"(F169*SQRT(D169)+SQRT(F169^2*D169-2*D169*LN('Other Graphs'!$A$6/'Other Graphs'!$A$9)-2*Data!D169^2*'Other Graphs'!$A$3))/D169","v":0.35},{"$f":"(F169*SQRT(D169)-SQRT(F169^2*D169-2*D169*LN('Other Graphs'!$A$6/'Other Graphs'!$A$9)-2*Data!D169^2*'Other Graphs'!$A$3))/D169","v":0.20000000000000009},null,null,null,131.000001,{"$f":"IF($C$4, 'Option vs Time'!$A$6*S169-EXP(-1*'Option vs Time'!$A$3*O169)*'Option vs Time'!$A$9*T169,-1*'Option vs Time'!$A$6*S169+EXP(-1*'Option vs Time'!$A$3*O169)*'Option vs Time'!$A$9*T169)","v":99.015101977915606},{"$f":"(LN('Option vs Time'!$A$6/'Option vs Time'!$A$9)+('Option vs Time'!$A$3+0.5*'Option vs Time'!$A$15^2)*O169)/('Option vs Time'!$A$15*SQRT(O169))","v":3.1058824309256718},{"$f":"Q169-'Option vs Time'!$A$15*SQRT(O169)","v":0.81677779373671155},0.99905143936044749,0.79297228763457506,3.337651494172178E-2]
[null,null,null,132.000001,{"$f":"IF($C$4, 'Other Graphs'!$A$6*H170-EXP(-1*'Other Graphs'!$A$3*D170)*'Other Graphs'!$A$9*I170,-1*'Other Graphs'!$A$6*H170+EXP(-1*'Other Graphs'!$A$3*D170)*'Other Graphs'!$A$9*I170)","v":109.03999859476799},{"$f":"(LN('Other Graphs'!$A$6/'Other Graphs'!$A$9)+('Other Graphs'!$A$3+0.5*'Other Graphs'!$A$15^2)*D170)/('Other Graphs'!$A$15*SQRT(D170))","v":3.1595094675637547},{"$f":"F170-'Other Graphs'!$A$15*SQRT(D170)","v":0.86168440024466042},0.99920982517113066,0.80556939388048909,{"$f":"(F170*SQRT(D170)+SQRT(F170^2*D170-2*D170*LN('Other Graphs'!$A$6/'Other Graphs'!$A$9)-2*Data!D170^2*'Other Graphs'!$A$3))/D170","v":0.35},{"$f":"(F170*SQRT(D170)-SQRT(F170^2*D170-2*D170*LN('Other Graphs'!$A$6/'Other Graphs'!$A$9)-2*Data!D170^2*'Other Graphs'!$A$3))/D170","v":0.20000000000000004},null,null,null,132.000001,{"$f":"IF($C$4, 'Option vs Time'!$A$6*S170-EXP(-1*'Option vs Time'!$A$3*O170)*'Option vs Time'!$A$9*T170,-1*'Option vs Time'!$A$6*S170+EXP(-1*'Option vs Time'!$A$3*O170)*'Option vs Time'!$A$9*T170)","v":99.048478492857328},{"$f":"(LN('Option vs Time'!$A$6/'Option vs Time'!$A$9)+('Option vs Time'!$A$3+0.5*'Option vs Time'!$A$15^2)*O170)/('Option vs Time'!$A$15*SQRT(O170))","v":3.1180310359982379},{"$f":"Q170-'Option vs Time'!$A$15*SQRT(O170)","v":0.82020596867914364},0.99908968184840963,0.7939506500185457,3.2247467393020202E-2]
[null,null,null,133.000001,{"$f":"IF($C$4, 'Other Graphs'!$A$6*H171-EXP(-1*'Other Graphs'!$A$3*D171)*'Other Graphs'!$A$9*I171,-1*'Other Graphs'!$A$6*H171+EXP(-1*'Other Graphs'!$A$3*D171)*'Other Graphs'!$A$9*I171)","v":109.07258748430465},{"$f":"(LN('Other Graphs'!$A$6/'Other Graphs'!$A$9)+('Other Graphs'!$A$3+0.5*'Other Graphs'!$A$15^2)*D171)/('Other Graphs'!$A$15*SQRT(D171))","v":3.1714547254572314},{"$f":"F171-'Other Graphs'!$A$15*SQRT(D171)","v":0.86494219785197268},0.99924161245376875,0.80646474243915689,{"$f":"(F171*SQRT(D171)+SQRT(F171^2*D171-2*D171*LN('Other Graphs'!$A$6/'Other Graphs'!$A$9)-2*Data!D171^2*'Other Graphs'!$A$3))/D171","v":0.3500000000000002},{"$f":"(F171*SQRT(D171)-SQRT(F171^2*D171-2*D171*LN('Other Graphs'!$A$6/'Other Graphs'!$A$9)-2*Data!D171^2*'Other Graphs'!$A$3))/D171","v":0.19999999999999982},null,null,null,133.000001,{"$f":"IF($C$4, 'Option vs Time'!$A$6*S171-EXP(-1*'Option vs Time'!$A$3*O171)*'Option vs Time'!$A$9*T171,-1*'Option vs Time'!$A$6*S171+EXP(-1*'Option vs Time'!$A$3*O171)*'Option vs Time'!$A$9*T171)","v":99.080725960250348},{"$f":"(LN('Option vs Time'!$A$6/'Option vs Time'!$A$9)+('Option vs Time'!$A$3+0.5*'Option vs Time'!$A$15^2)*O171)/('Option vs Time'!$A$15*SQRT(O171))","v":3.1301325220598448},{"$f":"Q171-'Option vs Time'!$A$15*SQRT(O171)","v":0.82361999445458611},0.99912636270411015,0.7949222442770969,3.1156542150100108E-2]
[null,null,null,134.000001,{"$f":"IF($C$4, 'Other Graphs'!$A$6*H172-EXP(-1*'Other Graphs'!$A$3*D172)*'Other Graphs'!$A$9*I172,-1*'Other Graphs'!$A$6*H172+EXP(-1*'Other Graphs'!$A$3*D172)*'Other Graphs'!$A$9*I172)","v":109.1040715306459},{"$f":"(LN('Other Graphs'!$A$6/'Other Graphs'!$A$9)+('Other Graphs'!$A$3+0.5*'Other Graphs'!$A$15^2)*D172)/('Other Graphs'!$A$15*SQRT(D172))","v":3.1833551601455032},{"$f":"F172-'Other Graphs'!$A$15*SQRT(D172)","v":0.86818777094877397},0.99927210536570099,0.80735422610542473,{"$f":"(F172*SQRT(D172)+SQRT(F172^2*D172-2*D172*LN('Other Graphs'!$A$6/'Other Graphs'!$A$9)-2*Data!D172^2*'Other Graphs'!$A$3))/D172","v":0.35000000000000009},{"$f":"(F172*SQRT(D172)-SQRT(F172^2*D172-2*D172*LN('Other Graphs'!$A$6/'Other Graphs'!$A$9)-2*Data!D172^2*'Other Graphs'!$A$3))/D172","v":0.1999999999999999},null,null,null,134.000001,{"$f":"IF($C$4, 'Option vs Time'!$A$6*S172-EXP(-1*'Option vs Time'!$A$3*O172)*'Option vs Time'!$A$9*T172,-1*'Option vs Time'!$A$6*S172+EXP(-1*'Option vs Time'!$A$3*O172)*'Option vs Time'!$A$9*T172)","v":99.111882502400448},{"$f":"(LN('Option vs Time'!$A$6/'Option vs Time'!$A$9)+('Option vs Time'!$A$3+0.5*'Option vs Time'!$A$15^2)*O172)/('Option vs Time'!$A$15*SQRT(O172))","v":3.1421874328143953},{"$f":"Q172-'Option vs Time'!$A$15*SQRT(O172)","v":0.82702004361766601},0.99916154674691604,0.79588714953340856,3.0102454160086722E-2]
[null,null,null,135.000001,{"$f":"IF($C$4, 'Other Graphs'!$A$6*H173-EXP(-1*'Other Graphs'!$A$3*D173)*'Other Graphs'!$A$9*I173,-1*'Other Graphs'!$A$6*H173+EXP(-1*'Other Graphs'!$A$3*D173)*'Other Graphs'!$A$9*I173)","v":109.1344881474373},{"$f":"(LN('Other Graphs'!$A$6/'Other Graphs'!$A$9)+('Other Graphs'!$A$3+0.5*'Other Graphs'!$A$15^2)*D173)/('Other Graphs'!$A$15*SQRT(D173))","v":3.1952112724552348},{"$f":"F173-'Other Graphs'!$A$15*SQRT(D173)","v":0.871421256124155},0.99930135743412851,0.80823790808918616,{"$f":"(F173*SQRT(D173)+SQRT(F173^2*D173-2*D173*LN('Other Graphs'!$A$6/'Other Graphs'!$A$9)-2*Data!D173^2*'Other Graphs'!$A$3))/D173","v":0.35000000000000003},{"$f":"(F173*SQRT(D173)-SQRT(F173^2*D173-2*D173*LN('Other Graphs'!$A$6/'Other Graphs'!$A$9)-2*Data!D173^2*'Other Graphs'!$A$3))/D173","v":0.20000000000000007},null,null,null,135.000001,{"$f":"IF($C$4, 'Option vs Time'!$A$6*S173-EXP(-1*'Option vs Time'!$A$3*O173)*'Option vs Time'!$A$9*T173,-1*'Option vs Time'!$A$6*S173+EXP(-1*'Option vs Time'!$A$3*O173)*'Option vs Time'!$A$9*T173)","v":99.141984956560535},{"$f":"(LN('Option vs Time'!$A$6/'Option vs Time'!$A$9)+('Option vs Time'!$A$3+0.5*'Option vs Time'!$A$15^2)*O173)/('Option vs Time'!$A$15*SQRT(O173))","v":3.154196301595344},{"$f":"Q173-'Option vs Time'!$A$15*SQRT(O173)","v":0.83040628526426419},0.99919529604825563,0.7968454434078478,2.9083961648439072E-2]
[null,null,null,136.000001,{"$f":"IF($C$4, 'Other Graphs'!$A$6*H174-EXP(-1*'Other Graphs'!$A$3*D174)*'Other Graphs'!$A$9*I174,-1*'Other Graphs'!$A$6*H174+EXP(-1*'Other Graphs'!$A$3*D174)*'Other Graphs'!$A$9*I174)","v":109.16387348218798},{"$f":"(LN('Other Graphs'!$A$6/'Other Graphs'!$A$9)+('Other Graphs'!$A$3+0.5*'Other Graphs'!$A$15^2)*D174)/('Other Graphs'!$A$15*SQRT(D174))","v":3.2070235539554428},{"$f":"F174-'Other Graphs'!$A$15*SQRT(D174)","v":0.87464278744239321},0.99932941992819835,0.80911585049862678,{"$f":"(F174*SQRT(D174)+SQRT(F174^2*D174-2*D174*LN('Other Graphs'!$A$6/'Other Graphs'!$A$9)-2*Data!D174^2*'Other Graphs'!$A$3))/D174","v":0.35},{"$f":"(F174*SQRT(D174)-SQRT(F174^2*D174-2*D174*LN('Other Graphs'!$A$6/'Other Graphs'!$A$9)-2*Data!D174^2*'Other Graphs'!$A$3))/D174","v":0.19999999999999998},null,null,null,136.000001,{"$f":"IF($C$4, 'Option vs Time'!$A$6*S174-EXP(-1*'Option vs Time'!$A$3*O174)*'Option vs Time'!$A$9*T174,-1*'Option vs Time'!$A$6*S174+EXP(-1*'Option vs Time'!$A$3*O174)*'Option vs Time'!$A$9*T174)","v":99.171068918208974},{"$f":"(LN('Option vs Time'!$A$6/'Option vs Time'!$A$9)+('Option vs Time'!$A$3+0.5*'Option vs Time'!$A$15^2)*O174)/('Option vs Time'!$A$15*SQRT(O174))","v":3.1661596516403785},{"$f":"Q174-'Option vs Time'!$A$15*SQRT(O174)","v":0.83377888512732889},0.99922767005137081,0.79779720205853777,2.8099864660021012E-2]
[null,null,null,137.000001,{"$f":"IF($C$4, 'Other Graphs'!$A$6*H175-EXP(-1*'Other Graphs'!$A$3*D175)*'Other Graphs'!$A$9*I175,-1*'Other Graphs'!$A$6*H175+EXP(-1*'Other Graphs'!$A$3*D175)*'Other Graphs'!$A$9*I175)","v":109.19226245914726},{"$f":"(LN('Other Graphs'!$A$6/'Other Graphs'!$A$9)+('Other Graphs'!$A$3+0.5*'Other Graphs'!$A$15^2)*D175)/('Other Graphs'!$A$15*SQRT(D175))","v":3.2187924871953149},{"$f":"F175-'Other Graphs'!$A$15*SQRT(D175)","v":0.87785249650781294},0.99935634195675749,0.80998811436770046,{"$f":"(F175*SQRT(D175)+SQRT(F175^2*D175-2*D175*LN('Other Graphs'!$A$6/'Other Graphs'!$A$9)-2*Data!D175^2*'Other Graphs'!$A$3))/D175","v":0.35},{"$f":"(F175*SQRT(D175)-SQRT(F175^2*D175-2*D175*LN('Other Graphs'!$A$6/'Other Graphs'!$A$9)-2*Data!D175^2*'Other Graphs'!$A$3))/D175","v":0.20000000000000007},null,null,null,137.000001,{"$f":"IF($C$4, 'Option vs Time'!$A$6*S175-EXP(-1*'Option vs Time'!$A$3*O175)*'Option vs Time'!$A$9*T175,-1*'Option vs Time'!$A$6*S175+EXP(-1*'Option vs Time'!$A$3*O175)*'Option vs Time'!$A$9*T175)","v":99.199168782868995},{"$f":"(LN('Option vs Time'!$A$6/'Option vs Time'!$A$9)+('Option vs Time'!$A$3+0.5*'Option vs Time'!$A$15^2)*O175)/('Option vs Time'!$A$15*SQRT(O175))","v":3.1780779963568144},{"$f":"Q175-'Option vs Time'!$A$15*SQRT(O175)","v":0.83713800566931251},0.99925872568565977,0.79874250022051596,2.7149003648688108E-2]
[null,null,null,138.000001,{"$f":"IF($C$4, 'Other Graphs'!$A$6*H176-EXP(-1*'Other Graphs'!$A$3*D176)*'Other Graphs'!$A$9*I176,-1*'Other Graphs'!$A$6*H176+EXP(-1*'Other Graphs'!$A$3*D176)*'Other Graphs'!$A$9*I176)","v":109.21968882072362},{"$f":"(LN('Other Graphs'!$A$6/'Other Graphs'!$A$9)+('Other Graphs'!$A$3+0.5*'Other Graphs'!$A$15^2)*D176)/('Other Graphs'!$A$15*SQRT(D176))","v":3.2305185459342285},{"$f":"F176-'Other Graphs'!$A$15*SQRT(D176)","v":0.88105051252751698},0.99938217056172873,0.81085475968271636,{"$f":"(F176*SQRT(D176)+SQRT(F176^2*D176-2*D176*LN('Other Graphs'!$A$6/'Other Graphs'!$A$9)-2*Data!D176^2*'Other Graphs'!$A$3))/D176","v":0.35000000000000014},{"$f":"(F176*SQRT(D176)-SQRT(F176^2*D176-2*D176*LN('Other Graphs'!$A$6/'Other Graphs'!$A$9)-2*Data!D176^2*'Other Graphs'!$A$3))/D176","v":0.19999999999999987},null,null,null,138.000001,{"$f":"IF($C$4, 'Option vs Time'!$A$6*S176-EXP(-1*'Option vs Time'!$A$3*O176)*'Option vs Time'!$A$9*T176,-1*'Option vs Time'!$A$6*S176+EXP(-1*'Option vs Time'!$A$3*O176)*'Option vs Time'!$A$9*T176)","v":99.226317786517683},{"$f":"(LN('Option vs Time'!$A$6/'Option vs Time'!$A$9)+('Option vs Time'!$A$3+0.5*'Option vs Time'!$A$15^2)*O176)/('Option vs Time'!$A$15*SQRT(O176))","v":3.1899518395780984},{"$f":"Q176-'Option vs Time'!$A$15*SQRT(O176)","v":0.84048380617138685},0.99928851747586434,0.79968141124354342,2.6230258115745642E-2]
[null,null,null,139.000001,{"$f":"IF($C$4, 'Other Graphs'!$A$6*H177-EXP(-1*'Other Graphs'!$A$3*D177)*'Other Graphs'!$A$9*I177,-1*'Other Graphs'!$A$6*H177+EXP(-1*'Other Graphs'!$A$3*D177)*'Other Graphs'!$A$9*I177)","v":109.24618516749668},{"$f":"(LN('Other Graphs'!$A$6/'Other Graphs'!$A$9)+('Other Graphs'!$A$3+0.5*'Other Graphs'!$A$15^2)*D177)/('Other Graphs'!$A$15*SQRT(D177))","v":3.2422021953642872},{"$f":"F177-'Other Graphs'!$A$15*SQRT(D177)","v":0.88423696237207894},0.99940695080731501,0.81171584540807462,{"$f":"(F177*SQRT(D177)+SQRT(F177^2*D177-2*D177*LN('Other Graphs'!$A$6/'Other Graphs'!$A$9)-2*Data!D177^2*'Other Graphs'!$A$3))/D177","v":0.3500000000000002},{"$f":"(F177*SQRT(D177)-SQRT(F177^2*D177-2*D177*LN('Other Graphs'!$A$6/'Other Graphs'!$A$9)-2*Data!D177^2*'Other Graphs'!$A$3))/D177","v":0.19999999999999993},null,null,null,139.000001,{"$f":"IF($C$4, 'Option vs Time'!$A$6*S177-EXP(-1*'Option vs Time'!$A$3*O177)*'Option vs Time'!$A$9*T177,-1*'Option vs Time'!$A$6*S177+EXP(-1*'Option vs Time'!$A$3*O177)*'Option vs Time'!$A$9*T177)","v":99.252548044633429},{"$f":"(LN('Option vs Time'!$A$6/'Option vs Time'!$A$9)+('Option vs Time'!$A$3+0.5*'Option vs Time'!$A$15^2)*O177)/('Option vs Time'!$A$15*SQRT(O177))","v":3.201781675811767},{"$f":"Q177-'Option vs Time'!$A$15*SQRT(O177)","v":0.8438164428195587},0.99931709764634757,0.80061400712861963,2.5342545293881358E-2]
[null,null,null,140.000001,{"$f":"IF($C$4, 'Other Graphs'!$A$6*H178-EXP(-1*'Other Graphs'!$A$3*D178)*'Other Graphs'!$A$9*I178,-1*'Other Graphs'!$A$6*H178+EXP(-1*'Other Graphs'!$A$3*D178)*'Other Graphs'!$A$9*I178)","v":109.2717829968701},{"$f":"(LN('Other Graphs'!$A$6/'Other Graphs'!$A$9)+('Other Graphs'!$A$3+0.5*'Other Graphs'!$A$15^2)*D178)/('Other Graphs'!$A$15*SQRT(D178))","v":3.2538438923256603},{"$f":"F178-'Other Graphs'!$A$15*SQRT(D178)","v":0.88741197063427135},0.99943072586522574,0.81257142951118244,{"$f":"(F178*SQRT(D178)+SQRT(F178^2*D178-2*D178*LN('Other Graphs'!$A$6/'Other Graphs'!$A$9)-2*Data!D178^2*'Other Graphs'!$A$3))/D178","v":0.35000000000000014},{"$f":"(F178*SQRT(D178)-SQRT(F178^2*D178-2*D178*LN('Other Graphs'!$A$6/'Other Graphs'!$A$9)-2*Data!D178^2*'Other Graphs'!$A$3))/D178","v":0.19999999999999993},null,null,null,140.000001,{"$f":"IF($C$4, 'Option vs Time'!$A$6*S178-EXP(-1*'Option vs Time'!$A$3*O178)*'Option vs Time'!$A$9*T178,-1*'Option vs Time'!$A$6*S178+EXP(-1*'Option vs Time'!$A$3*O178)*'Option vs Time'!$A$9*T178)","v":99.27789058992731},{"$f":"(LN('Option vs Time'!$A$6/'Option vs Time'!$A$9)+('Option vs Time'!$A$3+0.5*'Option vs Time'!$A$15^2)*O178)/('Option vs Time'!$A$15*SQRT(O178))","v":3.2135679904792203},{"$f":"Q178-'Option vs Time'!$A$15*SQRT(O178)","v":0.84713606878783132},0.99934451622069054,0.80154035856325978,2.4484818876018721E-2]
[null,null,null,141.000001,{"$f":"IF($C$4, 'Other Graphs'!$A$6*H179-EXP(-1*'Other Graphs'!$A$3*D179)*'Other Graphs'!$A$9*I179,-1*'Other Graphs'!$A$6*H179+EXP(-1*'Other Graphs'!$A$3*D179)*'Other Graphs'!$A$9*I179)","v":109.296512740412},{"$f":"(LN('Other Graphs'!$A$6/'Other Graphs'!$A$9)+('Other Graphs'!$A$3+0.5*'Other Graphs'!$A$15^2)*D179)/('Other Graphs'!$A$15*SQRT(D179))","v":3.2654440855150169},{"$f":"F179-'Other Graphs'!$A$15*SQRT(D179)","v":0.89057565968591446},0.99945353709610985,0.81342156898658358,{"$f":"(F179*SQRT(D179)+SQRT(F179^2*D179-2*D179*LN('Other Graphs'!$A$6/'Other Graphs'!$A$9)-2*Data!D179^2*'Other Graphs'!$A$3))/D179","v":0.35000000000000014},{"$f":"(F179*SQRT(D179)-SQRT(F179^2*D179-2*D179*LN('Other Graphs'!$A$6/'Other Graphs'!$A$9)-2*Data!D179^2*'Other Graphs'!$A$3))/D179","v":0.1999999999999999},null,null,null,141.000001,{"$f":"IF($C$4, 'Option vs Time'!$A$6*S179-EXP(-1*'Option vs Time'!$A$3*O179)*'Option vs Time'!$A$9*T179,-1*'Option vs Time'!$A$6*S179+EXP(-1*'Option vs Time'!$A$3*O179)*'Option vs Time'!$A$9*T179)","v":99.302375408803329},{"$f":"(LN('Option vs Time'!$A$6/'Option vs Time'!$A$9)+('Option vs Time'!$A$3+0.5*'Option vs Time'!$A$15^2)*O179)/('Option vs Time'!$A$15*SQRT(O179))","v":3.2253112601476279},{"$f":"Q179-'Option vs Time'!$A$15*SQRT(O179)","v":0.85044283431852552},0.9993708211168294,0.80246053495558289,2.3656067786944845E-2]
[null,null,null,142.000001,{"$f":"IF($C$4, 'Other Graphs'!$A$6*H180-EXP(-1*'Other Graphs'!$A$3*D180)*'Other Graphs'!$A$9*I180,-1*'Other Graphs'!$A$6*H180+EXP(-1*'Other Graphs'!$A$3*D180)*'Other Graphs'!$A$9*I180)","v":109.32040379992794},{"$f":"(LN('Other Graphs'!$A$6/'Other Graphs'!$A$9)+('Other Graphs'!$A$3+0.5*'Other Graphs'!$A$15^2)*D180)/('Other Graphs'!$A$15*SQRT(D180))","v":3.2770032156873148},{"$f":"F180-'Other Graphs'!$A$15*SQRT(D180)","v":0.89372814973290415},0.99947542412737278,0.81426631987932852,{"$f":"(F180*SQRT(D180)+SQRT(F180^2*D180-2*D180*LN('Other Graphs'!$A$6/'Other Graphs'!$A$9)-2*Data!D180^2*'Other Graphs'!$A$3))/D180","v":0.35},{"$f":"(F180*SQRT(D180)-SQRT(F180^2*D180-2*D180*LN('Other Graphs'!$A$6/'Other Graphs'!$A$9)-2*Data!D180^2*'Other Graphs'!$A$3))/D180","v":0.20000000000000007},null,null,null,142.000001,{"$f":"IF($C$4, 'Option vs Time'!$A$6*S180-EXP(-1*'Option vs Time'!$A$3*O180)*'Option vs Time'!$A$9*T180,-1*'Option vs Time'!$A$6*S180+EXP(-1*'Option vs Time'!$A$3*O180)*'Option vs Time'!$A$9*T180)","v":99.326031476590273},{"$f":"(LN('Option vs Time'!$A$6/'Option vs Time'!$A$9)+('Option vs Time'!$A$3+0.5*'Option vs Time'!$A$15^2)*O180)/('Option vs Time'!$A$15*SQRT(O180))","v":3.2370119527542816},{"$f":"Q180-'Option vs Time'!$A$15*SQRT(O180)","v":0.85373688679987092},0.99939605823794064,0.80337460446725883,2.2855314996746756E-2]
[null,null,null,143.000001,{"$f":"IF($C$4, 'Other Graphs'!$A$6*H181-EXP(-1*'Other Graphs'!$A$3*D181)*'Other Graphs'!$A$9*I181,-1*'Other Graphs'!$A$6*H181+EXP(-1*'Other Graphs'!$A$3*D181)*'Other Graphs'!$A$9*I181)","v":109.34348458231001},{"$f":"(LN('Other Graphs'!$A$6/'Other Graphs'!$A$9)+('Other Graphs'!$A$3+0.5*'Other Graphs'!$A$15^2)*D181)/('Other Graphs'!$A$15*SQRT(D181))","v":3.2885217158512123},{"$f":"F181-'Other Graphs'!$A$15*SQRT(D181)","v":0.8968695588685125},0.99949642492754409,0.81510573730762048,{"$f":"(F181*SQRT(D181)+SQRT(F181^2*D181-2*D181*LN('Other Graphs'!$A$6/'Other Graphs'!$A$9)-2*Data!D181^2*'Other Graphs'!$A$3))/D181","v":0.35000000000000003},{"$f":"(F181*SQRT(D181)-SQRT(F181^2*D181-2*D181*LN('Other Graphs'!$A$6/'Other Graphs'!$A$9)-2*Data!D181^2*'Other Graphs'!$A$3))/D181","v":0.19999999999999998},null,null,null,143.000001,{"$f":"IF($C$4, 'Option vs Time'!$A$6*S181-EXP(-1*'Option vs Time'!$A$3*O181)*'Option vs Time'!$A$9*T181,-1*'Option vs Time'!$A$6*S181+EXP(-1*'Option vs Time'!$A$3*O181)*'Option vs Time'!$A$9*T181)","v":99.34888679158702},{"$f":"(LN('Option vs Time'!$A$6/'Option vs Time'!$A$9)+('Option vs Time'!$A$3+0.5*'Option vs Time'!$A$15^2)*O181)/('Option vs Time'!$A$15*SQRT(O181))","v":3.2486705278236991},{"$f":"Q181-'Option vs Time'!$A$15*SQRT(O181)","v":0.8570183708409993},0.99942027155927315,0.80428263404536415,2.2081616374364899E-2]
[null,null,null,144.000001,{"$f":"IF($C$4, 'Other Graphs'!$A$6*H182-EXP(-1*'Other Graphs'!$A$3*D182)*'Other Graphs'!$A$9*I182,-1*'Other Graphs'!$A$6*H182+EXP(-1*'Other Graphs'!$A$3*D182)*'Other Graphs'!$A$9*I182)","v":109.36578253320344},{"$f":"(LN('Other Graphs'!$A$6/'Other Graphs'!$A$9)+('Other Graphs'!$A$3+0.5*'Other Graphs'!$A$15^2)*D182)/('Other Graphs'!$A$15*SQRT(D182))","v":3.3000000114583337},{"$f":"F182-'Other Graphs'!$A$15*SQRT(D182)","v":0.90000000312500017},0.99951657587735399,0.81593987548475688,{"$f":"(F182*SQRT(D182)+SQRT(F182^2*D182-2*D182*LN('Other Graphs'!$A$6/'Other Graphs'!$A$9)-2*Data!D182^2*'Other Graphs'!$A$3))/D182","v":0.35000000000000009},{"$f":"(F182*SQRT(D182)-SQRT(F182^2*D182-2*D182*LN('Other Graphs'!$A$6/'Other Graphs'!$A$9)-2*Data!D182^2*'Other Graphs'!$A$3))/D182","v":0.19999999999999998},null,null,null,144.000001,{"$f":"IF($C$4, 'Option vs Time'!$A$6*S182-EXP(-1*'Option vs Time'!$A$3*O182)*'Option vs Time'!$A$9*T182,-1*'Option vs Time'!$A$6*S182+EXP(-1*'Option vs Time'!$A$3*O182)*'Option vs Time'!$A$9*T182)","v":99.370968407961385},{"$f":"(LN('Option vs Time'!$A$6/'Option vs Time'!$A$9)+('Option vs Time'!$A$3+0.5*'Option vs Time'!$A$15^2)*O182)/('Option vs Time'!$A$15*SQRT(O182))","v":3.2602874366777557},{"$f":"Q182-'Option vs Time'!$A$15*SQRT(O182)","v":0.86028742834442218},0.99944350321111608,0.80518468945318666,2.1334059579643849E-2]
[null,null,null,145.000001,{"$f":"IF($C$4, 'Other Graphs'!$A$6*H183-EXP(-1*'Other Graphs'!$A$3*D183)*'Other Graphs'!$A$9*I183,-1*'Other Graphs'!$A$6*H183+EXP(-1*'Other Graphs'!$A$3*D183)*'Other Graphs'!$A$9*I183)","v":109.38732416953174},{"$f":"(LN('Other Graphs'!$A$6/'Other Graphs'!$A$9)+('Other Graphs'!$A$3+0.5*'Other Graphs'!$A$15^2)*D183)/('Other Graphs'!$A$15*SQRT(D183))","v":3.311438520586635},{"$f":"F183-'Other Graphs'!$A$15*SQRT(D183)","v":0.90311959652362805},0.99953591183767243,0.81676878774040107,{"$f":"(F183*SQRT(D183)+SQRT(F183^2*D183-2*D183*LN('Other Graphs'!$A$6/'Other Graphs'!$A$9)-2*Data!D183^2*'Other Graphs'!$A$3))/D183","v":0.35000000000000003},{"$f":"(F183*SQRT(D183)-SQRT(F183^2*D183-2*D183*LN('Other Graphs'!$A$6/'Other Graphs'!$A$9)-2*Data!D183^2*'Other Graphs'!$A$3))/D183","v":0.19999999999999998},null,null,null,145.000001,{"$f":"IF($C$4, 'Option vs Time'!$A$6*S183-EXP(-1*'Option vs Time'!$A$3*O183)*'Option vs Time'!$A$9*T183,-1*'Option vs Time'!$A$6*S183+EXP(-1*'Option vs Time'!$A$3*O183)*'Option vs Time'!$A$9*T183)","v":99.392302467541029},{"$f":"(LN('Option vs Time'!$A$6/'Option vs Time'!$A$9)+('Option vs Time'!$A$3+0.5*'Option vs Time'!$A$15^2)*O183)/('Option vs Time'!$A$15*SQRT(O183))","v":3.2718631226391199},{"$f":"Q183-'Option vs Time'!$A$15*SQRT(O183)","v":0.86354419857611298},0.99946579355808074,0.80608083530002472,2.0611762993226534E-2]
[null,null,null,146.000001,{"$f":"IF($C$4, 'Other Graphs'!$A$6*H184-EXP(-1*'Other Graphs'!$A$3*D184)*'Other Graphs'!$A$9*I184,-1*'Other Graphs'!$A$6*H184+EXP(-1*'Other Graphs'!$A$3*D184)*'Other Graphs'!$A$9*I184)","v":109.40813511091878},{"$f":"(LN('Other Graphs'!$A$6/'Other Graphs'!$A$9)+('Other Graphs'!$A$3+0.5*'Other Graphs'!$A$15^2)*D184)/('Other Graphs'!$A$15*SQRT(D184))","v":3.322837654118088},{"$f":"F184-'Other Graphs'!$A$15*SQRT(D184)","v":0.90622845112311445},0.99955446621445254,0.81759252654120151,{"$f":"(F184*SQRT(D184)+SQRT(F184^2*D184-2*D184*LN('Other Graphs'!$A$6/'Other Graphs'!$A$9)-2*Data!D184^2*'Other Graphs'!$A$3))/D184","v":0.34999999999999987},{"$f":"(F184*SQRT(D184)-SQRT(F184^2*D184-2*D184*LN('Other Graphs'!$A$6/'Other Graphs'!$A$9)-2*Data!D184^2*'Other Graphs'!$A$3))/D184","v":0.20000000000000009},null,null,null,146.000001,{"$f":"IF($C$4, 'Option vs Time'!$A$6*S184-EXP(-1*'Option vs Time'!$A$3*O184)*'Option vs Time'!$A$9*T184,-1*'Option vs Time'!$A$6*S184+EXP(-1*'Option vs Time'!$A$3*O184)*'Option vs Time'!$A$9*T184)","v":99.412914230534255},{"$f":"(LN('Option vs Time'!$A$6/'Option vs Time'!$A$9)+('Option vs Time'!$A$3+0.5*'Option vs Time'!$A$15^2)*O184)/('Option vs Time'!$A$15*SQRT(O184))","v":3.2833980212282503},{"$f":"Q184-'Option vs Time'!$A$15*SQRT(O184)","v":0.8667888182332768},0.99948718127486846,0.80697113507001672,1.9913874682131905E-2]
[null,null,null,147.000001,{"$f":"IF($C$4, 'Other Graphs'!$A$6*H185-EXP(-1*'Other Graphs'!$A$3*D185)*'Other Graphs'!$A$9*I185,-1*'Other Graphs'!$A$6*H185+EXP(-1*'Other Graphs'!$A$3*D185)*'Other Graphs'!$A$9*I185)","v":109.42824011004598},{"$f":"(LN('Other Graphs'!$A$6/'Other Graphs'!$A$9)+('Other Graphs'!$A$3+0.5*'Other Graphs'!$A$15^2)*D185)/('Other Graphs'!$A$15*SQRT(D185))","v":3.3341978159108976},{"$f":"F185-'Other Graphs'!$A$15*SQRT(D185)","v":0.90932667706660819},0.99957227102081736,0.81841114351079136,{"$f":"(F185*SQRT(D185)+SQRT(F185^2*D185-2*D185*LN('Other Graphs'!$A$6/'Other Graphs'!$A$9)-2*Data!D185^2*'Other Graphs'!$A$3))/D185","v":0.34999999999999992},{"$f":"(F185*SQRT(D185)-SQRT(F185^2*D185-2*D185*LN('Other Graphs'!$A$6/'Other Graphs'!$A$9)-2*Data!D185^2*'Other Graphs'!$A$3))/D185","v":0.20000000000000009},null,null,null,147.000001,{"$f":"IF($C$4, 'Option vs Time'!$A$6*S185-EXP(-1*'Option vs Time'!$A$3*O185)*'Option vs Time'!$A$9*T185,-1*'Option vs Time'!$A$6*S185+EXP(-1*'Option vs Time'!$A$3*O185)*'Option vs Time'!$A$9*T185)","v":99.432828105216387},{"$f":"(LN('Option vs Time'!$A$6/'Option vs Time'!$A$9)+('Option vs Time'!$A$3+0.5*'Option vs Time'!$A$15^2)*O185)/('Option vs Time'!$A$15*SQRT(O185))","v":3.2948925603542039},{"$f":"Q185-'Option vs Time'!$A$15*SQRT(O185)","v":0.87002142150991446},0.99950770341868544,0.80785565115004554,1.9239571400703426E-2]
[null,null,null,148.000001,{"$f":"IF($C$4, 'Other Graphs'!$A$6*H186-EXP(-1*'Other Graphs'!$A$3*D186)*'Other Graphs'!$A$9*I186,-1*'Other Graphs'!$A$6*H186+EXP(-1*'Other Graphs'!$A$3*D186)*'Other Graphs'!$A$9*I186)","v":109.44766308198056},{"$f":"(LN('Other Graphs'!$A$6/'Other Graphs'!$A$9)+('Other Graphs'!$A$3+0.5*'Other Graphs'!$A$15^2)*D186)/('Other Graphs'!$A$15*SQRT(D186))","v":3.3455194029664517},{"$f":"F186-'Other Graphs'!$A$15*SQRT(D186)","v":0.91241438262721442},0.99958935693641948,0.8192246894491817,{"$f":"(F186*SQRT(D186)+SQRT(F186^2*D186-2*D186*LN('Other Graphs'!$A$6/'Other Graphs'!$A$9)-2*Data!D186^2*'Other Graphs'!$A$3))/D186","v":0.3500000000000002},{"$f":"(F186*SQRT(D186)-SQRT(F186^2*D186-2*D186*LN('Other Graphs'!$A$6/'Other Graphs'!$A$9)-2*Data!D186^2*'Other Graphs'!$A$3))/D186","v":0.19999999999999993},null,null,null,148.000001,{"$f":"IF($C$4, 'Option vs Time'!$A$6*S186-EXP(-1*'Option vs Time'!$A$3*O186)*'Option vs Time'!$A$9*T186,-1*'Option vs Time'!$A$6*S186+EXP(-1*'Option vs Time'!$A$3*O186)*'Option vs Time'!$A$9*T186)","v":99.452067676617091},{"$f":"(LN('Option vs Time'!$A$6/'Option vs Time'!$A$9)+('Option vs Time'!$A$3+0.5*'Option vs Time'!$A$15^2)*O186)/('Option vs Time'!$A$15*SQRT(O186))","v":3.3063471604994836},{"$f":"Q186-'Option vs Time'!$A$15*SQRT(O186)","v":0.87324214016024637},0.99952739549845926,0.8087344448567455,1.8588057624995713E-2]
[null,null,null,149.000001,{"$f":"IF($C$4, 'Other Graphs'!$A$6*H187-EXP(-1*'Other Graphs'!$A$3*D187)*'Other Graphs'!$A$9*I187,-1*'Other Graphs'!$A$6*H187+EXP(-1*'Other Graphs'!$A$3*D187)*'Other Graphs'!$A$9*I187)","v":109.46642713251012},{"$f":"(LN('Other Graphs'!$A$6/'Other Graphs'!$A$9)+('Other Graphs'!$A$3+0.5*'Other Graphs'!$A$15^2)*D187)/('Other Graphs'!$A$15*SQRT(D187))","v":3.3568028055912076},{"$f":"F187-'Other Graphs'!$A$15*SQRT(D187)","v":0.91549167425214772},0.99960575336419777,0.82003321435157872,{"$f":"(F187*SQRT(D187)+SQRT(F187^2*D187-2*D187*LN('Other Graphs'!$A$6/'Other Graphs'!$A$9)-2*Data!D187^2*'Other Graphs'!$A$3))/D187","v":0.35000000000000014},{"$f":"(F187*SQRT(D187)-SQRT(F187^2*D187-2*D187*LN('Other Graphs'!$A$6/'Other Graphs'!$A$9)-2*Data!D187^2*'Other Graphs'!$A$3))/D187","v":0.19999999999999996},null,null,null,149.000001,{"$f":"IF($C$4, 'Option vs Time'!$A$6*S187-EXP(-1*'Option vs Time'!$A$3*O187)*'Option vs Time'!$A$9*T187,-1*'Option vs Time'!$A$6*S187+EXP(-1*'Option vs Time'!$A$3*O187)*'Option vs Time'!$A$9*T187)","v":99.470655734242087},{"$f":"(LN('Option vs Time'!$A$6/'Option vs Time'!$A$9)+('Option vs Time'!$A$3+0.5*'Option vs Time'!$A$15^2)*O187)/('Option vs Time'!$A$15*SQRT(O187))","v":3.3177622348991598},{"$f":"Q187-'Option vs Time'!$A$15*SQRT(O187)","v":0.87645110356009992},0.99954629154100538,0.80960757646265502,1.7958564619789286E-2]
[null,null,null,150.000001,{"$f":"IF($C$4, 'Other Graphs'!$A$6*H188-EXP(-1*'Other Graphs'!$A$3*D188)*'Other Graphs'!$A$9*I188,-1*'Other Graphs'!$A$6*H188+EXP(-1*'Other Graphs'!$A$3*D188)*'Other Graphs'!$A$9*I188)","v":109.48455458551734},{"$f":"(LN('Other Graphs'!$A$6/'Other Graphs'!$A$9)+('Other Graphs'!$A$3+0.5*'Other Graphs'!$A$15^2)*D188)/('Other Graphs'!$A$15*SQRT(D188))","v":3.3680484075536978},{"$f":"F188-'Other Graphs'!$A$15*SQRT(D188)","v":0.91855865660555347},0.9996214884846506,0.82083676742664313,{"$f":"(F188*SQRT(D188)+SQRT(F188^2*D188-2*D188*LN('Other Graphs'!$A$6/'Other Graphs'!$A$9)-2*Data!D188^2*'Other Graphs'!$A$3))/D188","v":0.35000000000000003},{"$f":"(F188*SQRT(D188)-SQRT(F188^2*D188-2*D188*LN('Other Graphs'!$A$6/'Other Graphs'!$A$9)-2*Data!D188^2*'Other Graphs'!$A$3))/D188","v":0.20000000000000007},null,null,null,150.000001,{"$f":"IF($C$4, 'Option vs Time'!$A$6*S188-EXP(-1*'Option vs Time'!$A$3*O188)*'Option vs Time'!$A$9*T188,-1*'Option vs Time'!$A$6*S188+EXP(-1*'Option vs Time'!$A$3*O188)*'Option vs Time'!$A$9*T188)","v":99.488614298861876},{"$f":"(LN('Option vs Time'!$A$6/'Option vs Time'!$A$9)+('Option vs Time'!$A$3+0.5*'Option vs Time'!$A$15^2)*O188)/('Option vs Time'!$A$15*SQRT(O188))","v":3.3291381897144792},{"$f":"Q188-'Option vs Time'!$A$15*SQRT(O188)","v":0.87964843876633481},0.99956442415428026,0.81047510522154365,1.7350349537196053E-2]
[null,null,null,151.000001,{"$f":"IF($C$4, 'Other Graphs'!$A$6*H189-EXP(-1*'Other Graphs'!$A$3*D189)*'Other Graphs'!$A$9*I189,-1*'Other Graphs'!$A$6*H189+EXP(-1*'Other Graphs'!$A$3*D189)*'Other Graphs'!$A$9*I189)","v":109.50206700942752},{"$f":"(LN('Other Graphs'!$A$6/'Other Graphs'!$A$9)+('Other Graphs'!$A$3+0.5*'Other Graphs'!$A$15^2)*D189)/('Other Graphs'!$A$15*SQRT(D189))","v":3.3792565862368305},{"$f":"F189-'Other Graphs'!$A$15*SQRT(D189)","v":0.92161543261004386},0.99963658930773713,0.82163539711421008,{"$f":"(F189*SQRT(D189)+SQRT(F189^2*D189-2*D189*LN('Other Graphs'!$A$6/'Other Graphs'!$A$9)-2*Data!D189^2*'Other Graphs'!$A$3))/D189","v":0.34999999999999981},{"$f":"(F189*SQRT(D189)-SQRT(F189^2*D189-2*D189*LN('Other Graphs'!$A$6/'Other Graphs'!$A$9)-2*Data!D189^2*'Other Graphs'!$A$3))/D189","v":0.20000000000000012},null,null,null,151.000001,{"$f":"IF($C$4, 'Option vs Time'!$A$6*S189-EXP(-1*'Option vs Time'!$A$3*O189)*'Option vs Time'!$A$9*T189,-1*'Option vs Time'!$A$6*S189+EXP(-1*'Option vs Time'!$A$3*O189)*'Option vs Time'!$A$9*T189)","v":99.505964648399072},{"$f":"(LN('Option vs Time'!$A$6/'Option vs Time'!$A$9)+('Option vs Time'!$A$3+0.5*'Option vs Time'!$A$15^2)*O189)/('Option vs Time'!$A$15*SQRT(O189))","v":3.3404754242011627},{"$f":"Q189-'Option vs Time'!$A$15*SQRT(O189)","v":0.88283427057437613},0.99958182458785738,0.81133708939294591,1.6762694545434442E-2]
[null,null,null,152.000001,{"$f":"IF($C$4, 'Other Graphs'!$A$6*H190-EXP(-1*'Other Graphs'!$A$3*D190)*'Other Graphs'!$A$9*I190,-1*'Other Graphs'!$A$6*H190+EXP(-1*'Other Graphs'!$A$3*D190)*'Other Graphs'!$A$9*I190)","v":109.51898524276055},{"$f":"(LN('Other Graphs'!$A$6/'Other Graphs'!$A$9)+('Other Graphs'!$A$3+0.5*'Other Graphs'!$A$15^2)*D190)/('Other Graphs'!$A$15*SQRT(D190))","v":3.3904277127856592},{"$f":"F190-'Other Graphs'!$A$15*SQRT(D190)","v":0.92466210348699729},0.99965108172251471,0.8224291511024916,{"$f":"(F190*SQRT(D190)+SQRT(F190^2*D190-2*D190*LN('Other Graphs'!$A$6/'Other Graphs'!$A$9)-2*Data!D190^2*'Other Graphs'!$A$3))/D190","v":0.34999999999999976},{"$f":"(F190*SQRT(D190)-SQRT(F190^2*D190-2*D190*LN('Other Graphs'!$A$6/'Other Graphs'!$A$9)-2*Data!D190^2*'Other Graphs'!$A$3))/D190","v":0.20000000000000021},null,null,null,152.000001,{"$f":"IF($C$4, 'Option vs Time'!$A$6*S190-EXP(-1*'Option vs Time'!$A$3*O190)*'Option vs Time'!$A$9*T190,-1*'Option vs Time'!$A$6*S190+EXP(-1*'Option vs Time'!$A$3*O190)*'Option vs Time'!$A$9*T190)","v":99.522727342944506},{"$f":"(LN('Option vs Time'!$A$6/'Option vs Time'!$A$9)+('Option vs Time'!$A$3+0.5*'Option vs Time'!$A$15^2)*O190)/('Option vs Time'!$A$15*SQRT(O190))","v":3.3517743308725931},{"$f":"Q190-'Option vs Time'!$A$15*SQRT(O190)","v":0.88600872157393118},0.99959852279075134,0.81219358626593197,1.6194905987248376E-2]
[null,null,null,153.000001,{"$f":"IF($C$4, 'Other Graphs'!$A$6*H191-EXP(-1*'Other Graphs'!$A$3*D191)*'Other Graphs'!$A$9*I191,-1*'Other Graphs'!$A$6*H191+EXP(-1*'Other Graphs'!$A$3*D191)*'Other Graphs'!$A$9*I191)","v":109.5353294188178},{"$f":"(LN('Other Graphs'!$A$6/'Other Graphs'!$A$9)+('Other Graphs'!$A$3+0.5*'Other Graphs'!$A$15^2)*D191)/('Other Graphs'!$A$15*SQRT(D191))","v":3.401562152250786},{"$f":"F191-'Other Graphs'!$A$15*SQRT(D191)","v":0.92769876879566882},0.99966499054461444,0.82321807634477873,{"$f":"(F191*SQRT(D191)+SQRT(F191^2*D191-2*D191*LN('Other Graphs'!$A$6/'Other Graphs'!$A$9)-2*Data!D191^2*'Other Graphs'!$A$3))/D191","v":0.34999999999999992},{"$f":"(F191*SQRT(D191)-SQRT(F191^2*D191-2*D191*LN('Other Graphs'!$A$6/'Other Graphs'!$A$9)-2*Data!D191^2*'Other Graphs'!$A$3))/D191","v":0.20000000000000004},null,null,null,153.000001,{"$f":"IF($C$4, 'Option vs Time'!$A$6*S191-EXP(-1*'Option vs Time'!$A$3*O191)*'Option vs Time'!$A$9*T191,-1*'Option vs Time'!$A$6*S191+EXP(-1*'Option vs Time'!$A$3*O191)*'Option vs Time'!$A$9*T191)","v":99.538922248931755},{"$f":"(LN('Option vs Time'!$A$6/'Option vs Time'!$A$9)+('Option vs Time'!$A$3+0.5*'Option vs Time'!$A$15^2)*O191)/('Option vs Time'!$A$15*SQRT(O191))","v":3.3630352956580785},{"$f":"Q191-'Option vs Time'!$A$15*SQRT(O191)","v":0.88917191220296132},0.99961454746671019,0.81304465218214439,1.5646313566392678E-2]
[null,null,null,154.000001,{"$f":"IF($C$4, 'Other Graphs'!$A$6*H192-EXP(-1*'Other Graphs'!$A$3*D192)*'Other Graphs'!$A$9*I192,-1*'Other Graphs'!$A$6*H192+EXP(-1*'Other Graphs'!$A$3*D192)*'Other Graphs'!$A$9*I192)","v":109.55111898953314},{"$f":"(LN('Other Graphs'!$A$6/'Other Graphs'!$A$9)+('Other Graphs'!$A$3+0.5*'Other Graphs'!$A$15^2)*D192)/('Other Graphs'!$A$15*SQRT(D192))","v":3.4126602637275516},{"$f":"F192-'Other Graphs'!$A$15*SQRT(D192)","v":0.93072552647115048},0.99967833956165242,0.82400221907566151,{"$f":"(F192*SQRT(D192)+SQRT(F192^2*D192-2*D192*LN('Other Graphs'!$A$6/'Other Graphs'!$A$9)-2*Data!D192^2*'Other Graphs'!$A$3))/D192","v":0.35000000000000003},{"$f":"(F192*SQRT(D192)-SQRT(F192^2*D192-2*D192*LN('Other Graphs'!$A$6/'Other Graphs'!$A$9)-2*Data!D192^2*'Other Graphs'!$A$3))/D192","v":0.20000000000000004},null,null,null,154.000001,{"$f":"IF($C$4, 'Option vs Time'!$A$6*S192-EXP(-1*'Option vs Time'!$A$3*O192)*'Option vs Time'!$A$9*T192,-1*'Option vs Time'!$A$6*S192+EXP(-1*'Option vs Time'!$A$3*O192)*'Option vs Time'!$A$9*T192)","v":99.554568562498147},{"$f":"(LN('Option vs Time'!$A$6/'Option vs Time'!$A$9)+('Option vs Time'!$A$3+0.5*'Option vs Time'!$A$15^2)*O192)/('Option vs Time'!$A$15*SQRT(O192))","v":3.3742586980563751},{"$f":"Q192-'Option vs Time'!$A$15*SQRT(O192)","v":0.892323960799974},0.99962992612709178,0.81389034255812898,1.5116269561815443E-2]
[null,null,null,155.000001,{"$f":"IF($C$4, 'Other Graphs'!$A$6*H193-EXP(-1*'Other Graphs'!$A$3*D193)*'Other Graphs'!$A$9*I193,-1*'Other Graphs'!$A$6*H193+EXP(-1*'Other Graphs'!$A$3*D193)*'Other Graphs'!$A$9*I193)","v":109.56637274851688},{"$f":"(LN('Other Graphs'!$A$6/'Other Graphs'!$A$9)+('Other Graphs'!$A$3+0.5*'Other Graphs'!$A$15^2)*D193)/('Other Graphs'!$A$15*SQRT(D193))","v":3.4237224004911675},{"$f":"F193-'Other Graphs'!$A$15*SQRT(D193)","v":0.93374247286122758},0.99969115157666932,0.82478162482678541,{"$f":"(F193*SQRT(D193)+SQRT(F193^2*D193-2*D193*LN('Other Graphs'!$A$6/'Other Graphs'!$A$9)-2*Data!D193^2*'Other Graphs'!$A$3))/D193","v":0.35000000000000014},{"$f":"(F193*SQRT(D193)-SQRT(F193^2*D193-2*D193*LN('Other Graphs'!$A$6/'Other Graphs'!$A$9)-2*Data!D193^2*'Other Graphs'!$A$3))/D193","v":0.19999999999999996},null,null,null,155.000001,{"$f":"IF($C$4, 'Option vs Time'!$A$6*S193-EXP(-1*'Option vs Time'!$A$3*O193)*'Option vs Time'!$A$9*T193,-1*'Option vs Time'!$A$6*S193+EXP(-1*'Option vs Time'!$A$3*O193)*'Option vs Time'!$A$9*T193)","v":99.569684832059963},{"$f":"(LN('Option vs Time'!$A$6/'Option vs Time'!$A$9)+('Option vs Time'!$A$3+0.5*'Option vs Time'!$A$15^2)*O193)/('Option vs Time'!$A$15*SQRT(O193))","v":3.3854449112846399},{"$f":"Q193-'Option vs Time'!$A$15*SQRT(O193)","v":0.89546498365469995},0.99964468514143356,0.81473071190698598,1.4604148068031009E-2]
[null,null,null,156.000001,{"$f":"IF($C$4, 'Other Graphs'!$A$6*H194-EXP(-1*'Other Graphs'!$A$3*D194)*'Other Graphs'!$A$9*I194,-1*'Other Graphs'!$A$6*H194+EXP(-1*'Other Graphs'!$A$3*D194)*'Other Graphs'!$A$9*I194)","v":109.58110885331965},{"$f":"(LN('Other Graphs'!$A$6/'Other Graphs'!$A$9)+('Other Graphs'!$A$3+0.5*'Other Graphs'!$A$15^2)*D194)/('Other Graphs'!$A$15*SQRT(D194))","v":3.4347489101279294},{"$f":"F194-'Other Graphs'!$A$15*SQRT(D194)","v":0.93674970276216207},0.99970344844968717,0.82555633844215626,{"$f":"(F194*SQRT(D194)+SQRT(F194^2*D194-2*D194*LN('Other Graphs'!$A$6/'Other Graphs'!$A$9)-2*Data!D194^2*'Other Graphs'!$A$3))/D194","v":0.34999999999999992},{"$f":"(F194*SQRT(D194)-SQRT(F194^2*D194-2*D194*LN('Other Graphs'!$A$6/'Other Graphs'!$A$9)-2*Data!D194^2*'Other Graphs'!$A$3))/D194","v":0.20000000000000007},null,null,null,156.000001,{"$f":"IF($C$4, 'Option vs Time'!$A$6*S194-EXP(-1*'Option vs Time'!$A$3*O194)*'Option vs Time'!$A$9*T194,-1*'Option vs Time'!$A$6*S194+EXP(-1*'Option vs Time'!$A$3*O194)*'Option vs Time'!$A$9*T194)","v":99.584288980127994},{"$f":"(LN('Option vs Time'!$A$6/'Option vs Time'!$A$9)+('Option vs Time'!$A$3+0.5*'Option vs Time'!$A$15^2)*O194)/('Option vs Time'!$A$15*SQRT(O194))","v":3.3965943024229759},{"$f":"Q194-'Option vs Time'!$A$15*SQRT(O194)","v":0.89859509505720858},0.99965884978581931,0.81556581385936533,1.4109344261356682E-2]
[null,null,null,157.000001,{"$f":"IF($C$4, 'Other Graphs'!$A$6*H195-EXP(-1*'Other Graphs'!$A$3*D195)*'Other Graphs'!$A$9*I195,-1*'Other Graphs'!$A$6*H195+EXP(-1*'Other Graphs'!$A$3*D195)*'Other Graphs'!$A$9*I195)","v":109.59534484694308},{"$f":"(LN('Other Graphs'!$A$6/'Other Graphs'!$A$9)+('Other Graphs'!$A$3+0.5*'Other Graphs'!$A$15^2)*D195)/('Other Graphs'!$A$15*SQRT(D195))","v":3.4457401346626533},{"$f":"F195-'Other Graphs'!$A$15*SQRT(D195)","v":0.93974730945345053},0.99971525113746718,0.82632640409301505,{"$f":"(F195*SQRT(D195)+SQRT(F195^2*D195-2*D195*LN('Other Graphs'!$A$6/'Other Graphs'!$A$9)-2*Data!D195^2*'Other Graphs'!$A$3))/D195","v":0.35},{"$f":"(F195*SQRT(D195)-SQRT(F195^2*D195-2*D195*LN('Other Graphs'!$A$6/'Other Graphs'!$A$9)-2*Data!D195^2*'Other Graphs'!$A$3))/D195","v":0.20000000000000007},null,null,null,157.000001,{"$f":"IF($C$4, 'Option vs Time'!$A$6*S195-EXP(-1*'Option vs Time'!$A$3*O195)*'Option vs Time'!$A$9*T195,-1*'Option vs Time'!$A$6*S195+EXP(-1*'Option vs Time'!$A$3*O195)*'Option vs Time'!$A$9*T195)","v":99.59839832438935},{"$f":"(LN('Option vs Time'!$A$6/'Option vs Time'!$A$9)+('Option vs Time'!$A$3+0.5*'Option vs Time'!$A$15^2)*O195)/('Option vs Time'!$A$15*SQRT(O195))","v":3.4077072325547353},{"$f":"Q195-'Option vs Time'!$A$15*SQRT(O195)","v":0.90171440734553254},0.99967244428914259,0.81639570118383253,1.3631273690521084E-2]
[null,null,null,158.000001,{"$f":"IF($C$4, 'Other Graphs'!$A$6*H196-EXP(-1*'Other Graphs'!$A$3*D196)*'Other Graphs'!$A$9*I196,-1*'Other Graphs'!$A$6*H196+EXP(-1*'Other Graphs'!$A$3*D196)*'Other Graphs'!$A$9*I196)","v":109.60909767862262},{"$f":"(LN('Other Graphs'!$A$6/'Other Graphs'!$A$9)+('Other Graphs'!$A$3+0.5*'Other Graphs'!$A$15^2)*D196)/('Other Graphs'!$A$15*SQRT(D196))","v":3.45669641068246},{"$f":"F196-'Other Graphs'!$A$15*SQRT(D196)","v":0.94273538473158025},0.99972657973154977,0.82709186529229117,{"$f":"(F196*SQRT(D196)+SQRT(F196^2*D196-2*D196*LN('Other Graphs'!$A$6/'Other Graphs'!$A$9)-2*Data!D196^2*'Other Graphs'!$A$3))/D196","v":0.35},{"$f":"(F196*SQRT(D196)-SQRT(F196^2*D196-2*D196*LN('Other Graphs'!$A$6/'Other Graphs'!$A$9)-2*Data!D196^2*'Other Graphs'!$A$3))/D196","v":0.20000000000000004},null,null,null,158.000001,{"$f":"IF($C$4, 'Option vs Time'!$A$6*S196-EXP(-1*'Option vs Time'!$A$3*O196)*'Option vs Time'!$A$9*T196,-1*'Option vs Time'!$A$6*S196+EXP(-1*'Option vs Time'!$A$3*O196)*'Option vs Time'!$A$9*T196)","v":99.612029598079872},{"$f":"(LN('Option vs Time'!$A$6/'Option vs Time'!$A$9)+('Option vs Time'!$A$3+0.5*'Option vs Time'!$A$15^2)*O196)/('Option vs Time'!$A$15*SQRT(O196))","v":3.4187840569027208},{"$f":"Q196-'Option vs Time'!$A$15*SQRT(O196)","v":0.90482303095184102},0.99968549187736144,0.81722042580662579,1.3169371591530421E-2]
[null,null,null,159.000001,{"$f":"IF($C$4, 'Other Graphs'!$A$6*H197-EXP(-1*'Other Graphs'!$A$3*D197)*'Other Graphs'!$A$9*I197,-1*'Other Graphs'!$A$6*H197+EXP(-1*'Other Graphs'!$A$3*D197)*'Other Graphs'!$A$9*I197)","v":109.62238372390722},{"$f":"(LN('Other Graphs'!$A$6/'Other Graphs'!$A$9)+('Other Graphs'!$A$3+0.5*'Other Graphs'!$A$15^2)*D197)/('Other Graphs'!$A$15*SQRT(D197))","v":3.4676180694570444},{"$f":"F197-'Other Graphs'!$A$15*SQRT(D197)","v":0.94571401894283014},0.99973745349465271,0.82785276490865478,{"$f":"(F197*SQRT(D197)+SQRT(F197^2*D197-2*D197*LN('Other Graphs'!$A$6/'Other Graphs'!$A$9)-2*Data!D197^2*'Other Graphs'!$A$3))/D197","v":0.35000000000000003},{"$f":"(F197*SQRT(D197)-SQRT(F197^2*D197-2*D197*LN('Other Graphs'!$A$6/'Other Graphs'!$A$9)-2*Data!D197^2*'Other Graphs'!$A$3))/D197","v":0.19999999999999996},null,null,null,159.000001,{"$f":"IF($C$4, 'Option vs Time'!$A$6*S197-EXP(-1*'Option vs Time'!$A$3*O197)*'Option vs Time'!$A$9*T197,-1*'Option vs Time'!$A$6*S197+EXP(-1*'Option vs Time'!$A$3*O197)*'Option vs Time'!$A$9*T197)","v":99.625198969671402},{"$f":"(LN('Option vs Time'!$A$6/'Option vs Time'!$A$9)+('Option vs Time'!$A$3+0.5*'Option vs Time'!$A$15^2)*O197)/('Option vs Time'!$A$15*SQRT(O197))","v":3.4298251249614391},{"$f":"Q197-'Option vs Time'!$A$15*SQRT(O197)","v":0.90792107444722481},0.99969801481583476,0.81804003883082754,1.2723092225257915E-2]
[null,null,null,160.000001,{"$f":"IF($C$4, 'Other Graphs'!$A$6*H198-EXP(-1*'Other Graphs'!$A$3*D198)*'Other Graphs'!$A$9*I198,-1*'Other Graphs'!$A$6*H198+EXP(-1*'Other Graphs'!$A$3*D198)*'Other Graphs'!$A$9*I198)","v":109.63521880405995},{"$f":"(LN('Other Graphs'!$A$6/'Other Graphs'!$A$9)+('Other Graphs'!$A$3+0.5*'Other Graphs'!$A$15^2)*D198)/('Other Graphs'!$A$15*SQRT(D198))","v":3.478505437055547},{"$f":"F198-'Other Graphs'!$A$15*SQRT(D198)","v":0.94868330101514919},0.99974789089550065,0.82860914518017892,{"$f":"(F198*SQRT(D198)+SQRT(F198^2*D198-2*D198*LN('Other Graphs'!$A$6/'Other Graphs'!$A$9)-2*Data!D198^2*'Other Graphs'!$A$3))/D198","v":0.3500000000000002},{"$f":"(F198*SQRT(D198)-SQRT(F198^2*D198-2*D198*LN('Other Graphs'!$A$6/'Other Graphs'!$A$9)-2*Data!D198^2*'Other Graphs'!$A$3))/D198","v":0.19999999999999987},null,null,null,160.000001,{"$f":"IF($C$4, 'Option vs Time'!$A$6*S198-EXP(-1*'Option vs Time'!$A$3*O198)*'Option vs Time'!$A$9*T198,-1*'Option vs Time'!$A$6*S198+EXP(-1*'Option vs Time'!$A$3*O198)*'Option vs Time'!$A$9*T198)","v":99.63792206189666},{"$f":"(LN('Option vs Time'!$A$6/'Option vs Time'!$A$9)+('Option vs Time'!$A$3+0.5*'Option vs Time'!$A$15^2)*O198)/('Option vs Time'!$A$15*SQRT(O198))","v":3.4408307806255491},{"$f":"Q198-'Option vs Time'!$A$15*SQRT(O198)","v":0.91100864458515129},0.99971003444982565,0.81885459055497412,1.2291908237472171E-2]
[null,null,null,161.000001,{"$f":"IF($C$4, 'Other Graphs'!$A$6*H199-EXP(-1*'Other Graphs'!$A$3*D199)*'Other Graphs'!$A$9*I199,-1*'Other Graphs'!$A$6*H199+EXP(-1*'Other Graphs'!$A$3*D199)*'Other Graphs'!$A$9*I199)","v":109.64761820480223},{"$f":"(LN('Other Graphs'!$A$6/'Other Graphs'!$A$9)+('Other Graphs'!$A$3+0.5*'Other Graphs'!$A$15^2)*D199)/('Other Graphs'!$A$15*SQRT(D199))","v":3.4893588344601363},{"$f":"F199-'Other Graphs'!$A$15*SQRT(D199)","v":0.95164331848912775},0.99975790964215649,0.82936104772762209,{"$f":"(F199*SQRT(D199)+SQRT(F199^2*D199-2*D199*LN('Other Graphs'!$A$6/'Other Graphs'!$A$9)-2*Data!D199^2*'Other Graphs'!$A$3))/D199","v":0.35000000000000003},{"$f":"(F199*SQRT(D199)-SQRT(F199^2*D199-2*D199*LN('Other Graphs'!$A$6/'Other Graphs'!$A$9)-2*Data!D199^2*'Other Graphs'!$A$3))/D199","v":0.20000000000000004},null,null,null,161.000001,{"$f":"IF($C$4, 'Option vs Time'!$A$6*S199-EXP(-1*'Option vs Time'!$A$3*O199)*'Option vs Time'!$A$9*T199,-1*'Option vs Time'!$A$6*S199+EXP(-1*'Option vs Time'!$A$3*O199)*'Option vs Time'!$A$9*T199)","v":99.650213970134132},{"$f":"(LN('Option vs Time'!$A$6/'Option vs Time'!$A$9)+('Option vs Time'!$A$3+0.5*'Option vs Time'!$A$15^2)*O199)/('Option vs Time'!$A$15*SQRT(O199))","v":3.4518013623146198},{"$f":"Q199-'Option vs Time'!$A$15*SQRT(O199)","v":0.91408584634361123},0.99972157124325445,0.81966413049111719,1.1875310040494469E-2]
[null,null,null,162.000001,{"$f":"IF($C$4, 'Other Graphs'!$A$6*H200-EXP(-1*'Other Graphs'!$A$3*D200)*'Other Graphs'!$A$9*I200,-1*'Other Graphs'!$A$6*H200+EXP(-1*'Other Graphs'!$A$3*D200)*'Other Graphs'!$A$9*I200)","v":109.65959669442434},{"$f":"(LN('Other Graphs'!$A$6/'Other Graphs'!$A$9)+('Other Graphs'!$A$3+0.5*'Other Graphs'!$A$15^2)*D200)/('Other Graphs'!$A$15*SQRT(D200))","v":3.5001785776764307},{"$f":"F200-'Other Graphs'!$A$15*SQRT(D200)","v":0.95459415754811738},0.99976752671391955,0.8301085135673516,{"$f":"(F200*SQRT(D200)+SQRT(F200^2*D200-2*D200*LN('Other Graphs'!$A$6/'Other Graphs'!$A$9)-2*Data!D200^2*'Other Graphs'!$A$3))/D200","v":0.35000000000000009},{"$f":"(F200*SQRT(D200)-SQRT(F200^2*D200-2*D200*LN('Other Graphs'!$A$6/'Other Graphs'!$A$9)-2*Data!D200^2*'Other Graphs'!$A$3))/D200","v":0.19999999999999996},null,null,null,162.000001,{"$f":"IF($C$4, 'Option vs Time'!$A$6*S200-EXP(-1*'Option vs Time'!$A$3*O200)*'Option vs Time'!$A$9*T200,-1*'Option vs Time'!$A$6*S200+EXP(-1*'Option vs Time'!$A$3*O200)*'Option vs Time'!$A$9*T200)","v":99.662089280174627},{"$f":"(LN('Option vs Time'!$A$6/'Option vs Time'!$A$9)+('Option vs Time'!$A$3+0.5*'Option vs Time'!$A$15^2)*O200)/('Option vs Time'!$A$15*SQRT(O200))","v":3.4627372030943526},{"$f":"Q200-'Option vs Time'!$A$15*SQRT(O200)","v":0.9171527829660393},0.99973264481577917,0.82046870738236488,1.147280521546179E-2]
[null,null,null,163.000001,{"$f":"IF($C$4, 'Other Graphs'!$A$6*H201-EXP(-1*'Other Graphs'!$A$3*D201)*'Other Graphs'!$A$9*I201,-1*'Other Graphs'!$A$6*H201+EXP(-1*'Other Graphs'!$A$3*D201)*'Other Graphs'!$A$9*I201)","v":109.67116854128325},{"$f":"(LN('Other Graphs'!$A$6/'Other Graphs'!$A$9)+('Other Graphs'!$A$3+0.5*'Other Graphs'!$A$15^2)*D201)/('Other Graphs'!$A$15*SQRT(D201))","v":3.51096497784085},{"$f":"F201-'Other Graphs'!$A$15*SQRT(D201)","v":0.95753590304750436},0.99977675839185542,0.83085158312390939,{"$f":"(F201*SQRT(D201)+SQRT(F201^2*D201-2*D201*LN('Other Graphs'!$A$6/'Other Graphs'!$A$9)-2*Data!D201^2*'Other Graphs'!$A$3))/D201","v":0.34999999999999992},{"$f":"(F201*SQRT(D201)-SQRT(F201^2*D201-2*D201*LN('Other Graphs'!$A$6/'Other Graphs'!$A$9)-2*Data!D201^2*'Other Graphs'!$A$3))/D201","v":0.20000000000000007},null,null,null,163.000001,{"$f":"IF($C$4, 'Option vs Time'!$A$6*S201-EXP(-1*'Option vs Time'!$A$3*O201)*'Option vs Time'!$A$9*T201,-1*'Option vs Time'!$A$6*S201+EXP(-1*'Option vs Time'!$A$3*O201)*'Option vs Time'!$A$9*T201)","v":99.673562085390088},{"$f":"(LN('Option vs Time'!$A$6/'Option vs Time'!$A$9)+('Option vs Time'!$A$3+0.5*'Option vs Time'!$A$15^2)*O201)/('Option vs Time'!$A$15*SQRT(O201))","v":3.4736386307943632},{"$f":"Q201-'Option vs Time'!$A$15*SQRT(O201)","v":0.9202095560010175},0.99974327397827756,0.82126836921991297,1.108391793475505E-2]
[null,null,null,164.000001,{"$f":"IF($C$4, 'Other Graphs'!$A$6*H202-EXP(-1*'Other Graphs'!$A$3*D202)*'Other Graphs'!$A$9*I202,-1*'Other Graphs'!$A$6*H202+EXP(-1*'Other Graphs'!$A$3*D202)*'Other Graphs'!$A$9*I202)","v":109.68234753070905},{"$f":"(LN('Other Graphs'!$A$6/'Other Graphs'!$A$9)+('Other Graphs'!$A$3+0.5*'Other Graphs'!$A$15^2)*D202)/('Other Graphs'!$A$15*SQRT(D202))","v":3.521718341325013},{"$f":"F202-'Other Graphs'!$A$15*SQRT(D202)","v":0.96046863854318554},0.99978562028801787,0.83159029624224368,{"$f":"(F202*SQRT(D202)+SQRT(F202^2*D202-2*D202*LN('Other Graphs'!$A$6/'Other Graphs'!$A$9)-2*Data!D202^2*'Other Graphs'!$A$3))/D202","v":0.35},{"$f":"(F202*SQRT(D202)-SQRT(F202^2*D202-2*D202*LN('Other Graphs'!$A$6/'Other Graphs'!$A$9)-2*Data!D202^2*'Other Graphs'!$A$3))/D202","v":0.2},null,null,null,164.000001,{"$f":"IF($C$4, 'Option vs Time'!$A$6*S202-EXP(-1*'Option vs Time'!$A$3*O202)*'Option vs Time'!$A$9*T202,-1*'Option vs Time'!$A$6*S202+EXP(-1*'Option vs Time'!$A$3*O202)*'Option vs Time'!$A$9*T202)","v":99.684646003324843},{"$f":"(LN('Option vs Time'!$A$6/'Option vs Time'!$A$9)+('Option vs Time'!$A$3+0.5*'Option vs Time'!$A$15^2)*O202)/('Option vs Time'!$A$15*SQRT(O202))","v":3.4845059681226629},{"$f":"Q202-'Option vs Time'!$A$15*SQRT(O202)","v":0.92325626534083538},0.99975347676680271,0.82206316325959039,1.0708188403938834E-2]
[null,null,null,165.000001,{"$f":"IF($C$4, 'Other Graphs'!$A$6*H203-EXP(-1*'Other Graphs'!$A$3*D203)*'Other Graphs'!$A$9*I203,-1*'Other Graphs'!$A$6*H203+EXP(-1*'Other Graphs'!$A$3*D203)*'Other Graphs'!$A$9*I203)","v":109.69314698133951},{"$f":"(LN('Other Graphs'!$A$6/'Other Graphs'!$A$9)+('Other Graphs'!$A$3+0.5*'Other Graphs'!$A$15^2)*D203)/('Other Graphs'!$A$15*SQRT(D203))","v":3.5324389698372709},{"$f":"F203-'Other Graphs'!$A$15*SQRT(D203)","v":0.96339244631925558},0.99979412737341899,0.83232469219960648,{"$f":"(F203*SQRT(D203)+SQRT(F203^2*D203-2*D203*LN('Other Graphs'!$A$6/'Other Graphs'!$A$9)-2*Data!D203^2*'Other Graphs'!$A$3))/D203","v":0.35},{"$f":"(F203*SQRT(D203)-SQRT(F203^2*D203-2*D203*LN('Other Graphs'!$A$6/'Other Graphs'!$A$9)-2*Data!D203^2*'Other Graphs'!$A$3))/D203","v":0.2},null,null,null,165.000001,{"$f":"IF($C$4, 'Option vs Time'!$A$6*S203-EXP(-1*'Option vs Time'!$A$3*O203)*'Option vs Time'!$A$9*T203,-1*'Option vs Time'!$A$6*S203+EXP(-1*'Option vs Time'!$A$3*O203)*'Option vs Time'!$A$9*T203)","v":99.695354191728782},{"$f":"(LN('Option vs Time'!$A$6/'Option vs Time'!$A$9)+('Option vs Time'!$A$3+0.5*'Option vs Time'!$A$15^2)*O203)/('Option vs Time'!$A$15*SQRT(O203))","v":3.4953395327769372},{"$f":"Q203-'Option vs Time'!$A$15*SQRT(O203)","v":0.92629300925892188},0.99976327047507862,0.82285313603793164,1.0345172322402618E-2]
[null,null,null,166.000001,{"$f":"IF($C$4, 'Other Graphs'!$A$6*H204-EXP(-1*'Other Graphs'!$A$3*D204)*'Other Graphs'!$A$9*I204,-1*'Other Graphs'!$A$6*H204+EXP(-1*'Other Graphs'!$A$3*D204)*'Other Graphs'!$A$9*I204)","v":109.70357976090251},{"$f":"(LN('Other Graphs'!$A$6/'Other Graphs'!$A$9)+('Other Graphs'!$A$3+0.5*'Other Graphs'!$A$15^2)*D204)/('Other Graphs'!$A$15*SQRT(D204))","v":3.5431271605214798},{"$f":"F204-'Other Graphs'!$A$15*SQRT(D204)","v":0.96630740741494936},0.99980229400480514,0.83305480971713775,{"$f":"(F204*SQRT(D204)+SQRT(F204^2*D204-2*D204*LN('Other Graphs'!$A$6/'Other Graphs'!$A$9)-2*Data!D204^2*'Other Graphs'!$A$3))/D204","v":0.35000000000000026},{"$f":"(F204*SQRT(D204)-SQRT(F204^2*D204-2*D204*LN('Other Graphs'!$A$6/'Other Graphs'!$A$9)-2*Data!D204^2*'Other Graphs'!$A$3))/D204","v":0.19999999999999987},null,null,null,166.000001,{"$f":"IF($C$4, 'Option vs Time'!$A$6*S204-EXP(-1*'Option vs Time'!$A$3*O204)*'Option vs Time'!$A$9*T204,-1*'Option vs Time'!$A$6*S204+EXP(-1*'Option vs Time'!$A$3*O204)*'Option vs Time'!$A$9*T204)","v":99.705699364051185},{"$f":"(LN('Option vs Time'!$A$6/'Option vs Time'!$A$9)+('Option vs Time'!$A$3+0.5*'Option vs Time'!$A$15^2)*O204)/('Option vs Time'!$A$15*SQRT(O204))","v":3.5061396375527418},{"$f":"Q204-'Option vs Time'!$A$15*SQRT(O204)","v":0.92931988444621139},0.9997726716856018,0.82363833338779602,9.9944403621492484E-3]
[null,null,null,167.000001,{"$f":"IF($C$4, 'Other Graphs'!$A$6*H205-EXP(-1*'Other Graphs'!$A$3*D205)*'Other Graphs'!$A$9*I205,-1*'Other Graphs'!$A$6*H205+EXP(-1*'Other Graphs'!$A$3*D205)*'Other Graphs'!$A$9*I205)","v":109.71365830146478},{"$f":"(LN('Other Graphs'!$A$6/'Other Graphs'!$A$9)+('Other Graphs'!$A$3+0.5*'Other Graphs'!$A$15^2)*D205)/('Other Graphs'!$A$15*SQRT(D205))","v":3.5537832060530938},{"$f":"F205-'Other Graphs'!$A$15*SQRT(D205)","v":0.96921360165084458},0.99981013395028839,0.83378068697113805,{"$f":"(F205*SQRT(D205)+SQRT(F205^2*D205-2*D205*LN('Other Graphs'!$A$6/'Other Graphs'!$A$9)-2*Data!D205^2*'Other Graphs'!$A$3))/D205","v":0.35000000000000031},{"$f":"(F205*SQRT(D205)-SQRT(F205^2*D205-2*D205*LN('Other Graphs'!$A$6/'Other Graphs'!$A$9)-2*Data!D205^2*'Other Graphs'!$A$3))/D205","v":0.19999999999999979},null,null,null,167.000001,{"$f":"IF($C$4, 'Option vs Time'!$A$6*S205-EXP(-1*'Option vs Time'!$A$3*O205)*'Option vs Time'!$A$9*T205,-1*'Option vs Time'!$A$6*S205+EXP(-1*'Option vs Time'!$A$3*O205)*'Option vs Time'!$A$9*T205)","v":99.715693804413334},{"$f":"(LN('Option vs Time'!$A$6/'Option vs Time'!$A$9)+('Option vs Time'!$A$3+0.5*'Option vs Time'!$A$15^2)*O205)/('Option vs Time'!$A$15*SQRT(O205))","v":3.516906590448706},{"$f":"Q205-'Option vs Time'!$A$15*SQRT(O205)","v":0.93233698604645676},0.99978169629940949,0.82441880045354621,9.6555776640059321E-3]
[null,null,null,168.000001,{"$f":"IF($C$4, 'Other Graphs'!$A$6*H206-EXP(-1*'Other Graphs'!$A$3*D206)*'Other Graphs'!$A$9*I206,-1*'Other Graphs'!$A$6*H206+EXP(-1*'Other Graphs'!$A$3*D206)*'Other Graphs'!$A$9*I206)","v":109.72339461416534},{"$f":"(LN('Other Graphs'!$A$6/'Other Graphs'!$A$9)+('Other Graphs'!$A$3+0.5*'Other Graphs'!$A$15^2)*D206)/('Other Graphs'!$A$15*SQRT(D206))","v":3.5644073947326782},{"$f":"F206-'Other Graphs'!$A$15*SQRT(D206)","v":0.97211110765436626},0.99981766041388687,0.83450236160404578,{"$f":"(F206*SQRT(D206)+SQRT(F206^2*D206-2*D206*LN('Other Graphs'!$A$6/'Other Graphs'!$A$9)-2*Data!D206^2*'Other Graphs'!$A$3))/D206","v":0.34999999999999987},{"$f":"(F206*SQRT(D206)-SQRT(F206^2*D206-2*D206*LN('Other Graphs'!$A$6/'Other Graphs'!$A$9)-2*Data!D206^2*'Other Graphs'!$A$3))/D206","v":0.20000000000000015},null,null,null,168.000001,{"$f":"IF($C$4, 'Option vs Time'!$A$6*S206-EXP(-1*'Option vs Time'!$A$3*O206)*'Option vs Time'!$A$9*T206,-1*'Option vs Time'!$A$6*S206+EXP(-1*'Option vs Time'!$A$3*O206)*'Option vs Time'!$A$9*T206)","v":99.72534938207734},{"$f":"(LN('Option vs Time'!$A$6/'Option vs Time'!$A$9)+('Option vs Time'!$A$3+0.5*'Option vs Time'!$A$15^2)*O206)/('Option vs Time'!$A$15*SQRT(O206))","v":3.527640694768861},{"$f":"Q206-'Option vs Time'!$A$15*SQRT(O206)","v":0.93534440769054905},0.99979035956457385,0.82519458170580318,9.3281833509877288E-3]
[null,null,null,169.000001,{"$f":"IF($C$4, 'Other Graphs'!$A$6*H207-EXP(-1*'Other Graphs'!$A$3*D207)*'Other Graphs'!$A$9*I207,-1*'Other Graphs'!$A$6*H207+EXP(-1*'Other Graphs'!$A$3*D207)*'Other Graphs'!$A$9*I207)","v":109.73280030345074},{"$f":"(LN('Other Graphs'!$A$6/'Other Graphs'!$A$9)+('Other Graphs'!$A$3+0.5*'Other Graphs'!$A$15^2)*D207)/('Other Graphs'!$A$15*SQRT(D207))","v":3.5750000105769235},{"$f":"F207-'Other Graphs'!$A$15*SQRT(D207)","v":0.97500000288461575},0.99982488605901876,0.83521987073512827,{"$f":"(F207*SQRT(D207)+SQRT(F207^2*D207-2*D207*LN('Other Graphs'!$A$6/'Other Graphs'!$A$9)-2*Data!D207^2*'Other Graphs'!$A$3))/D207","v":0.35000000000000014},{"$f":"(F207*SQRT(D207)-SQRT(F207^2*D207-2*D207*LN('Other Graphs'!$A$6/'Other Graphs'!$A$9)-2*Data!D207^2*'Other Graphs'!$A$3))/D207","v":0.19999999999999996},null,null,null,169.000001,{"$f":"IF($C$4, 'Option vs Time'!$A$6*S207-EXP(-1*'Option vs Time'!$A$3*O207)*'Option vs Time'!$A$9*T207,-1*'Option vs Time'!$A$6*S207+EXP(-1*'Option vs Time'!$A$3*O207)*'Option vs Time'!$A$9*T207)","v":99.734677565428328},{"$f":"(LN('Option vs Time'!$A$6/'Option vs Time'!$A$9)+('Option vs Time'!$A$3+0.5*'Option vs Time'!$A$15^2)*O207)/('Option vs Time'!$A$15*SQRT(O207))","v":3.5383422492221759},{"$f":"Q207-'Option vs Time'!$A$15*SQRT(O207)","v":0.93834224152986812},0.99979867610347772,0.82596572095579301,9.0118700578614153E-3]
[null,null,null,170.000001,{"$f":"IF($C$4, 'Other Graphs'!$A$6*H208-EXP(-1*'Other Graphs'!$A$3*D208)*'Other Graphs'!$A$9*I208,-1*'Other Graphs'!$A$6*H208+EXP(-1*'Other Graphs'!$A$3*D208)*'Other Graphs'!$A$9*I208)","v":109.74188658082907},{"$f":"(LN('Other Graphs'!$A$6/'Other Graphs'!$A$9)+('Other Graphs'!$A$3+0.5*'Other Graphs'!$A$15^2)*D208)/('Other Graphs'!$A$15*SQRT(D208))","v":3.5855613334072252},{"$f":"F208-'Other Graphs'!$A$15*SQRT(D208)","v":0.97788036365651543},0.99983182303099749,0.83593325097088789,{"$f":"(F208*SQRT(D208)+SQRT(F208^2*D208-2*D208*LN('Other Graphs'!$A$6/'Other Graphs'!$A$9)-2*Data!D208^2*'Other Graphs'!$A$3))/D208","v":0.35},{"$f":"(F208*SQRT(D208)-SQRT(F208^2*D208-2*D208*LN('Other Graphs'!$A$6/'Other Graphs'!$A$9)-2*Data!D208^2*'Other Graphs'!$A$3))/D208","v":0.2},null,null,null,170.000001,{"$f":"IF($C$4, 'Option vs Time'!$A$6*S208-EXP(-1*'Option vs Time'!$A$3*O208)*'Option vs Time'!$A$9*T208,-1*'Option vs Time'!$A$6*S208+EXP(-1*'Option vs Time'!$A$3*O208)*'Option vs Time'!$A$9*T208)","v":99.743689435486189},{"$f":"(LN('Option vs Time'!$A$6/'Option vs Time'!$A$9)+('Option vs Time'!$A$3+0.5*'Option vs Time'!$A$15^2)*O208)/('Option vs Time'!$A$15*SQRT(O208))","v":3.5490115480193918},{"$f":"Q208-'Option vs Time'!$A$15*SQRT(O208)","v":0.94133057826868205},0.99980665993892681,0.82673226136929379,8.7062634765118219E-3]
[null,null,null,171.000001,{"$f":"IF($C$4, 'Other Graphs'!$A$6*H209-EXP(-1*'Other Graphs'!$A$3*D209)*'Other Graphs'!$A$9*I209,-1*'Other Graphs'!$A$6*H209+EXP(-1*'Other Graphs'!$A$3*D209)*'Other Graphs'!$A$9*I209)","v":109.75066427815929},{"$f":"(LN('Other Graphs'!$A$6/'Other Graphs'!$A$9)+('Other Graphs'!$A$3+0.5*'Other Graphs'!$A$15^2)*D209)/('Other Graphs'!$A$15*SQRT(D209))","v":3.5960916389359432},{"$f":"F209-'Other Graphs'!$A$15*SQRT(D209)","v":0.98075226516434766},0.99983848297857203,0.8366425384152063,{"$f":"(F209*SQRT(D209)+SQRT(F209^2*D209-2*D209*LN('Other Graphs'!$A$6/'Other Graphs'!$A$9)-2*Data!D209^2*'Other Graphs'!$A$3))/D209","v":0.34999999999999987},{"$f":"(F209*SQRT(D209)-SQRT(F209^2*D209-2*D209*LN('Other Graphs'!$A$6/'Other Graphs'!$A$9)-2*Data!D209^2*'Other Graphs'!$A$3))/D209","v":0.20000000000000012},null,null,null,171.000001,{"$f":"IF($C$4, 'Option vs Time'!$A$6*S209-EXP(-1*'Option vs Time'!$A$3*O209)*'Option vs Time'!$A$9*T209,-1*'Option vs Time'!$A$6*S209+EXP(-1*'Option vs Time'!$A$3*O209)*'Option vs Time'!$A$9*T209)","v":99.752395698962701},{"$f":"(LN('Option vs Time'!$A$6/'Option vs Time'!$A$9)+('Option vs Time'!$A$3+0.5*'Option vs Time'!$A$15^2)*O209)/('Option vs Time'!$A$15*SQRT(O209))","v":3.5596488809672602},{"$f":"Q209-'Option vs Time'!$A$15*SQRT(O209)","v":0.94430950719566464},0.99981432451914753,0.82749424548020567,8.4110019166701022E-3]
[null,null,null,172.000001,{"$f":"IF($C$4, 'Other Graphs'!$A$6*H210-EXP(-1*'Other Graphs'!$A$3*D210)*'Other Graphs'!$A$9*I210,-1*'Other Graphs'!$A$6*H210+EXP(-1*'Other Graphs'!$A$3*D210)*'Other Graphs'!$A$9*I210)","v":109.75914386049112},{"$f":"(LN('Other Graphs'!$A$6/'Other Graphs'!$A$9)+('Other Graphs'!$A$3+0.5*'Other Graphs'!$A$15^2)*D210)/('Other Graphs'!$A$15*SQRT(D210))","v":3.6065911988503774},{"$f":"F210-'Other Graphs'!$A$15*SQRT(D210)","v":0.98361578150464846},0.99984487707455239,0.83734776867922145,{"$f":"(F210*SQRT(D210)+SQRT(F210^2*D210-2*D210*LN('Other Graphs'!$A$6/'Other Graphs'!$A$9)-2*Data!D210^2*'Other Graphs'!$A$3))/D210","v":0.35000000000000009},{"$f":"(F210*SQRT(D210)-SQRT(F210^2*D210-2*D210*LN('Other Graphs'!$A$6/'Other Graphs'!$A$9)-2*Data!D210^2*'Other Graphs'!$A$3))/D210","v":0.19999999999999996},null,null,null,172.000001,{"$f":"IF($C$4, 'Option vs Time'!$A$6*S210-EXP(-1*'Option vs Time'!$A$3*O210)*'Option vs Time'!$A$9*T210,-1*'Option vs Time'!$A$6*S210+EXP(-1*'Option vs Time'!$A$3*O210)*'Option vs Time'!$A$9*T210)","v":99.760806700879371},{"$f":"(LN('Option vs Time'!$A$6/'Option vs Time'!$A$9)+('Option vs Time'!$A$3+0.5*'Option vs Time'!$A$15^2)*O210)/('Option vs Time'!$A$15*SQRT(O210))","v":3.5702545335602496},{"$f":"Q210-'Option vs Time'!$A$15*SQRT(O210)","v":0.94727911621452066},0.99982168274172034,0.8282517152037463,8.1257358813644487E-3]
[null,null,null,173.000001,{"$f":"IF($C$4, 'Other Graphs'!$A$6*H211-EXP(-1*'Other Graphs'!$A$3*D211)*'Other Graphs'!$A$9*I211,-1*'Other Graphs'!$A$6*H211+EXP(-1*'Other Graphs'!$A$3*D211)*'Other Graphs'!$A$9*I211)","v":109.76733543847124},{"$f":"(LN('Other Graphs'!$A$6/'Other Graphs'!$A$9)+('Other Graphs'!$A$3+0.5*'Other Graphs'!$A$15^2)*D211)/('Other Graphs'!$A$15*SQRT(D211))","v":3.6170602808945556},{"$f":"F211-'Other Graphs'!$A$15*SQRT(D211)","v":0.98647098569851499},0.99985101603556148,0.83804897689095381,{"$f":"(F211*SQRT(D211)+SQRT(F211^2*D211-2*D211*LN('Other Graphs'!$A$6/'Other Graphs'!$A$9)-2*Data!D211^2*'Other Graphs'!$A$3))/D211","v":0.35000000000000003},{"$f":"(F211*SQRT(D211)-SQRT(F211^2*D211-2*D211*LN('Other Graphs'!$A$6/'Other Graphs'!$A$9)-2*Data!D211^2*'Other Graphs'!$A$3))/D211","v":0.19999999999999998},null,null,null,173.000001,{"$f":"IF($C$4, 'Option vs Time'!$A$6*S211-EXP(-1*'Option vs Time'!$A$3*O211)*'Option vs Time'!$A$9*T211,-1*'Option vs Time'!$A$6*S211+EXP(-1*'Option vs Time'!$A$3*O211)*'Option vs Time'!$A$9*T211)","v":99.768932436760736},{"$f":"(LN('Option vs Time'!$A$6/'Option vs Time'!$A$9)+('Option vs Time'!$A$3+0.5*'Option vs Time'!$A$15^2)*O211)/('Option vs Time'!$A$15*SQRT(O211))","v":3.5808287870698146},{"$f":"Q211-'Option vs Time'!$A$15*SQRT(O211)","v":0.95023949187377399},0.99982874697649604,0.82900471184929114,7.8501276567095601E-3]
[null,null,null,174.000001,{"$f":"IF($C$4, 'Other Graphs'!$A$6*H212-EXP(-1*'Other Graphs'!$A$3*D212)*'Other Graphs'!$A$9*I212,-1*'Other Graphs'!$A$6*H212+EXP(-1*'Other Graphs'!$A$3*D212)*'Other Graphs'!$A$9*I212)","v":109.77524878032982},{"$f":"(LN('Other Graphs'!$A$6/'Other Graphs'!$A$9)+('Other Graphs'!$A$3+0.5*'Other Graphs'!$A$15^2)*D212)/('Other Graphs'!$A$15*SQRT(D212))","v":3.627499148948901},{"$f":"F212-'Other Graphs'!$A$15*SQRT(D212)","v":0.98931794971333664},0.99985691014095068,0.83874619770468917,{"$f":"(F212*SQRT(D212)+SQRT(F212^2*D212-2*D212*LN('Other Graphs'!$A$6/'Other Graphs'!$A$9)-2*Data!D212^2*'Other Graphs'!$A$3))/D212","v":0.35},{"$f":"(F212*SQRT(D212)-SQRT(F212^2*D212-2*D212*LN('Other Graphs'!$A$6/'Other Graphs'!$A$9)-2*Data!D212^2*'Other Graphs'!$A$3))/D212","v":0.20000000000000009},null,null,null,174.000001,{"$f":"IF($C$4, 'Option vs Time'!$A$6*S212-EXP(-1*'Option vs Time'!$A$3*O212)*'Option vs Time'!$A$9*T212,-1*'Option vs Time'!$A$6*S212+EXP(-1*'Option vs Time'!$A$3*O212)*'Option vs Time'!$A$9*T212)","v":99.776782564417445},{"$f":"(LN('Option vs Time'!$A$6/'Option vs Time'!$A$9)+('Option vs Time'!$A$3+0.5*'Option vs Time'!$A$15^2)*O212)/('Option vs Time'!$A$15*SQRT(O212))","v":3.5913719186313084},{"$f":"Q212-'Option vs Time'!$A$15*SQRT(O212)","v":0.95319071939574407},0.99983552908753737,0.8297532761328692,7.5838509152390543E-3]
[null,null,null,175.000001,{"$f":"IF($C$4, 'Other Graphs'!$A$6*H213-EXP(-1*'Other Graphs'!$A$3*D213)*'Other Graphs'!$A$9*I213,-1*'Other Graphs'!$A$6*H213+EXP(-1*'Other Graphs'!$A$3*D213)*'Other Graphs'!$A$9*I213)","v":109.78289332346242},{"$f":"(LN('Other Graphs'!$A$6/'Other Graphs'!$A$9)+('Other Graphs'!$A$3+0.5*'Other Graphs'!$A$15^2)*D213)/('Other Graphs'!$A$15*SQRT(D213))","v":3.6379080631078358},{"$f":"F213-'Other Graphs'!$A$15*SQRT(D213)","v":0.99215674448395585},0.9998625692509161,0.8394394653101207,{"$f":"(F213*SQRT(D213)+SQRT(F213^2*D213-2*D213*LN('Other Graphs'!$A$6/'Other Graphs'!$A$9)-2*Data!D213^2*'Other Graphs'!$A$3))/D213","v":0.3500000000000002},{"$f":"(F213*SQRT(D213)-SQRT(F213^2*D213-2*D213*LN('Other Graphs'!$A$6/'Other Graphs'!$A$9)-2*Data!D213^2*'Other Graphs'!$A$3))/D213","v":0.19999999999999984},null,null,null,175.000001,{"$f":"IF($C$4, 'Option vs Time'!$A$6*S213-EXP(-1*'Option vs Time'!$A$3*O213)*'Option vs Time'!$A$9*T213,-1*'Option vs Time'!$A$6*S213+EXP(-1*'Option vs Time'!$A$3*O213)*'Option vs Time'!$A$9*T213)","v":99.784366415332684},{"$f":"(LN('Option vs Time'!$A$6/'Option vs Time'!$A$9)+('Option vs Time'!$A$3+0.5*'Option vs Time'!$A$15^2)*O213)/('Option vs Time'!$A$15*SQRT(O213))","v":3.6018842013286041},{"$f":"Q213-'Option vs Time'!$A$15*SQRT(O213)","v":0.95613288270472419},0.99984204045413005,0.83049744818932236,7.3265903329655657E-3]
[null,null,null,176.000001,{"$f":"IF($C$4, 'Other Graphs'!$A$6*H214-EXP(-1*'Other Graphs'!$A$3*D214)*'Other Graphs'!$A$9*I214,-1*'Other Graphs'!$A$6*H214+EXP(-1*'Other Graphs'!$A$3*D214)*'Other Graphs'!$A$9*I214)","v":109.79027818561991},{"$f":"(LN('Other Graphs'!$A$6/'Other Graphs'!$A$9)+('Other Graphs'!$A$3+0.5*'Other Graphs'!$A$15^2)*D214)/('Other Graphs'!$A$15*SQRT(D214))","v":3.648287279755392},{"$f":"F214-'Other Graphs'!$A$15*SQRT(D214)","v":0.99498743993328809},0.99986800282384858,0.84012881344126267,{"$f":"(F214*SQRT(D214)+SQRT(F214^2*D214-2*D214*LN('Other Graphs'!$A$6/'Other Graphs'!$A$9)-2*Data!D214^2*'Other Graphs'!$A$3))/D214","v":0.34999999999999992},{"$f":"(F214*SQRT(D214)-SQRT(F214^2*D214-2*D214*LN('Other Graphs'!$A$6/'Other Graphs'!$A$9)-2*Data!D214^2*'Other Graphs'!$A$3))/D214","v":0.20000000000000004},null,null,null,176.000001,{"$f":"IF($C$4, 'Option vs Time'!$A$6*S214-EXP(-1*'Option vs Time'!$A$3*O214)*'Option vs Time'!$A$9*T214,-1*'Option vs Time'!$A$6*S214+EXP(-1*'Option vs Time'!$A$3*O214)*'Option vs Time'!$A$9*T214)","v":99.79169300566565},{"$f":"(LN('Option vs Time'!$A$6/'Option vs Time'!$A$9)+('Option vs Time'!$A$3+0.5*'Option vs Time'!$A$15^2)*O214)/('Option vs Time'!$A$15*SQRT(O214))","v":3.6123659042765031},{"$f":"Q214-'Option vs Time'!$A$15*SQRT(O214)","v":0.95906606445439913},0.99984829199090375,0.83123726758414218,7.0780412190032393E-3]
[null,null,null,177.000001,{"$f":"IF($C$4, 'Other Graphs'!$A$6*H215-EXP(-1*'Other Graphs'!$A$3*D215)*'Other Graphs'!$A$9*I215,-1*'Other Graphs'!$A$6*H215+EXP(-1*'Other Graphs'!$A$3*D215)*'Other Graphs'!$A$9*I215)","v":109.79741217572082},{"$f":"(LN('Other Graphs'!$A$6/'Other Graphs'!$A$9)+('Other Graphs'!$A$3+0.5*'Other Graphs'!$A$15^2)*D215)/('Other Graphs'!$A$15*SQRT(D215))","v":3.6586370516389022},{"$f":"F215-'Other Graphs'!$A$15*SQRT(D215)","v":0.9978101049924275},0.99987321993295342,0.84081427538514364,{"$f":"(F215*SQRT(D215)+SQRT(F215^2*D215-2*D215*LN('Other Graphs'!$A$6/'Other Graphs'!$A$9)-2*Data!D215^2*'Other Graphs'!$A$3))/D215","v":0.34999999999999992},{"$f":"(F215*SQRT(D215)-SQRT(F215^2*D215-2*D215*LN('Other Graphs'!$A$6/'Other Graphs'!$A$9)-2*Data!D215^2*'Other Graphs'!$A$3))/D215","v":0.20000000000000004},null,null,null,177.000001,{"$f":"IF($C$4, 'Option vs Time'!$A$6*S215-EXP(-1*'Option vs Time'!$A$3*O215)*'Option vs Time'!$A$9*T215,-1*'Option vs Time'!$A$6*S215+EXP(-1*'Option vs Time'!$A$3*O215)*'Option vs Time'!$A$9*T215)","v":99.798771046884653},{"$f":"(LN('Option vs Time'!$A$6/'Option vs Time'!$A$9)+('Option vs Time'!$A$3+0.5*'Option vs Time'!$A$15^2)*O215)/('Option vs Time'!$A$15*SQRT(O215))","v":3.6228172927010096},{"$f":"Q215-'Option vs Time'!$A$15*SQRT(O215)","v":0.96199034605453493},0.99985429416710025,0.83197277332499531,6.8379091576389328E-3]
[null,null,null,178.000001,{"$f":"IF($C$4, 'Other Graphs'!$A$6*H216-EXP(-1*'Other Graphs'!$A$3*D216)*'Other Graphs'!$A$9*I216,-1*'Other Graphs'!$A$6*H216+EXP(-1*'Other Graphs'!$A$3*D216)*'Other Graphs'!$A$9*I216)","v":109.80430380429769},{"$f":"(LN('Other Graphs'!$A$6/'Other Graphs'!$A$9)+('Other Graphs'!$A$3+0.5*'Other Graphs'!$A$15^2)*D216)/('Other Graphs'!$A$15*SQRT(D216))","v":3.6689576279408027},{"$f":"F216-'Other Graphs'!$A$15*SQRT(D216)","v":1.0006248076202189},0.99987822928216774,0.84149588399027775,{"$f":"(F216*SQRT(D216)+SQRT(F216^2*D216-2*D216*LN('Other Graphs'!$A$6/'Other Graphs'!$A$9)-2*Data!D216^2*'Other Graphs'!$A$3))/D216","v":0.35},{"$f":"(F216*SQRT(D216)-SQRT(F216^2*D216-2*D216*LN('Other Graphs'!$A$6/'Other Graphs'!$A$9)-2*Data!D216^2*'Other Graphs'!$A$3))/D216","v":0.20000000000000007},null,null,null,178.000001,{"$f":"IF($C$4, 'Option vs Time'!$A$6*S216-EXP(-1*'Option vs Time'!$A$3*O216)*'Option vs Time'!$A$9*T216,-1*'Option vs Time'!$A$6*S216+EXP(-1*'Option vs Time'!$A$3*O216)*'Option vs Time'!$A$9*T216)","v":99.805608956042292},{"$f":"(LN('Option vs Time'!$A$6/'Option vs Time'!$A$9)+('Option vs Time'!$A$3+0.5*'Option vs Time'!$A$15^2)*O216)/('Option vs Time'!$A$15*SQRT(O216))","v":3.6332386280175193},{"$f":"Q216-'Option vs Time'!$A$15*SQRT(O216)","v":0.96490580769693546},0.99986005702502778,0.83270400387294374,6.6059096626389646E-3]
[null,null,null,179.000001,{"$f":"IF($C$4, 'Other Graphs'!$A$6*H217-EXP(-1*'Other Graphs'!$A$3*D217)*'Other Graphs'!$A$9*I217,-1*'Other Graphs'!$A$6*H217+EXP(-1*'Other Graphs'!$A$3*D217)*'Other Graphs'!$A$9*I217)","v":109.81096129359088},{"$f":"(LN('Other Graphs'!$A$6/'Other Graphs'!$A$9)+('Other Graphs'!$A$3+0.5*'Other Graphs'!$A$15^2)*D217)/('Other Graphs'!$A$15*SQRT(D217))","v":3.6792492543486377},{"$f":"F217-'Other Graphs'!$A$15*SQRT(D217)","v":1.0034316148223565},0.99988303922140953,0.84217367167493229,{"$f":"(F217*SQRT(D217)+SQRT(F217^2*D217-2*D217*LN('Other Graphs'!$A$6/'Other Graphs'!$A$9)-2*Data!D217^2*'Other Graphs'!$A$3))/D217","v":0.35000000000000026},{"$f":"(F217*SQRT(D217)-SQRT(F217^2*D217-2*D217*LN('Other Graphs'!$A$6/'Other Graphs'!$A$9)-2*Data!D217^2*'Other Graphs'!$A$3))/D217","v":0.19999999999999984},null,null,null,179.000001,{"$f":"IF($C$4, 'Option vs Time'!$A$6*S217-EXP(-1*'Option vs Time'!$A$3*O217)*'Option vs Time'!$A$9*T217,-1*'Option vs Time'!$A$6*S217+EXP(-1*'Option vs Time'!$A$3*O217)*'Option vs Time'!$A$9*T217)","v":99.812214865704931},{"$f":"(LN('Option vs Time'!$A$6/'Option vs Time'!$A$9)+('Option vs Time'!$A$3+0.5*'Option vs Time'!$A$15^2)*O217)/('Option vs Time'!$A$15*SQRT(O217))","v":3.6436301679070073},{"$f":"Q217-'Option vs Time'!$A$15*SQRT(O217)","v":0.96781252838072618},0.99986559019773502,0.8334309971533741,6.3817678430098113E-3]
[null,null,null,180.000001,{"$f":"IF($C$4, 'Other Graphs'!$A$6*H218-EXP(-1*'Other Graphs'!$A$3*D218)*'Other Graphs'!$A$9*I218,-1*'Other Graphs'!$A$6*H218+EXP(-1*'Other Graphs'!$A$3*D218)*'Other Graphs'!$A$9*I218)","v":109.8173925873009},{"$f":"(LN('Other Graphs'!$A$6/'Other Graphs'!$A$9)+('Other Graphs'!$A$3+0.5*'Other Graphs'!$A$15^2)*D218)/('Other Graphs'!$A$15*SQRT(D218))","v":3.689512173123298},{"$f":"F218-'Other Graphs'!$A$15*SQRT(D218)","v":1.0062305926699904},0.99988765776118382,0.84284767043518793,{"$f":"(F218*SQRT(D218)+SQRT(F218^2*D218-2*D218*LN('Other Graphs'!$A$6/'Other Graphs'!$A$9)-2*Data!D218^2*'Other Graphs'!$A$3))/D218","v":0.35000000000000003},{"$f":"(F218*SQRT(D218)-SQRT(F218^2*D218-2*D218*LN('Other Graphs'!$A$6/'Other Graphs'!$A$9)-2*Data!D218^2*'Other Graphs'!$A$3))/D218","v":0.2},null,null,null,180.000001,{"$f":"IF($C$4, 'Option vs Time'!$A$6*S218-EXP(-1*'Option vs Time'!$A$3*O218)*'Option vs Time'!$A$9*T218,-1*'Option vs Time'!$A$6*S218+EXP(-1*'Option vs Time'!$A$3*O218)*'Option vs Time'!$A$9*T218)","v":99.818596633547941},{"$f":"(LN('Option vs Time'!$A$6/'Option vs Time'!$A$9)+('Option vs Time'!$A$3+0.5*'Option vs Time'!$A$15^2)*O218)/('Option vs Time'!$A$15*SQRT(O218))","v":3.6539921663902648},{"$f":"Q218-'Option vs Time'!$A$15*SQRT(O218)","v":0.97071058593695714},0.99987090292594027,0.83415379056664174,6.1652180800422229E-3]
[null,null,null,181.000001,{"$f":"IF($C$4, 'Other Graphs'!$A$6*H219-EXP(-1*'Other Graphs'!$A$3*D219)*'Other Graphs'!$A$9*I219,-1*'Other Graphs'!$A$6*H219+EXP(-1*'Other Graphs'!$A$3*D219)*'Other Graphs'!$A$9*I219)","v":109.82360536001143},{"$f":"(LN('Other Graphs'!$A$6/'Other Graphs'!$A$9)+('Other Graphs'!$A$3+0.5*'Other Graphs'!$A$15^2)*D219)/('Other Graphs'!$A$15*SQRT(D219))","v":3.6997466231655651},{"$f":"F219-'Other Graphs'!$A$15*SQRT(D219)","v":1.0090218063178815},0.99989209258657674,0.84351791185280611,{"$f":"(F219*SQRT(D219)+SQRT(F219^2*D219-2*D219*LN('Other Graphs'!$A$6/'Other Graphs'!$A$9)-2*Data!D219^2*'Other Graphs'!$A$3))/D219","v":0.35000000000000009},{"$f":"(F219*SQRT(D219)-SQRT(F219^2*D219-2*D219*LN('Other Graphs'!$A$6/'Other Graphs'!$A$9)-2*Data!D219^2*'Other Graphs'!$A$3))/D219","v":0.19999999999999996},null,null,null,181.000001,{"$f":"IF($C$4, 'Option vs Time'!$A$6*S219-EXP(-1*'Option vs Time'!$A$3*O219)*'Option vs Time'!$A$9*T219,-1*'Option vs Time'!$A$6*S219+EXP(-1*'Option vs Time'!$A$3*O219)*'Option vs Time'!$A$9*T219)","v":99.824761851627983},{"$f":"(LN('Option vs Time'!$A$6/'Option vs Time'!$A$9)+('Option vs Time'!$A$3+0.5*'Option vs Time'!$A$15^2)*O219)/('Option vs Time'!$A$15*SQRT(O219))","v":3.664324873900255},{"$f":"Q219-'Option vs Time'!$A$15*SQRT(O219)","v":0.97360005705257135},0.99987600407424604,0.83487242099844283,5.9560037151982215E-3]
[null,null,null,182.000001,{"$f":"IF($C$4, 'Other Graphs'!$A$6*H220-EXP(-1*'Other Graphs'!$A$3*D220)*'Other Graphs'!$A$9*I220,-1*'Other Graphs'!$A$6*H220+EXP(-1*'Other Graphs'!$A$3*D220)*'Other Graphs'!$A$9*I220)","v":109.82960702629366},{"$f":"(LN('Other Graphs'!$A$6/'Other Graphs'!$A$9)+('Other Graphs'!$A$3+0.5*'Other Graphs'!$A$15^2)*D220)/('Other Graphs'!$A$15*SQRT(D220))","v":3.70995284008099},{"$f":"F220-'Other Graphs'!$A$15*SQRT(D220)","v":1.0118053200220887},0.99989635107066077,0.84418442710290054,{"$f":"(F220*SQRT(D220)+SQRT(F220^2*D220-2*D220*LN('Other Graphs'!$A$6/'Other Graphs'!$A$9)-2*Data!D220^2*'Other Graphs'!$A$3))/D220","v":0.35000000000000014},{"$f":"(F220*SQRT(D220)-SQRT(F220^2*D220-2*D220*LN('Other Graphs'!$A$6/'Other Graphs'!$A$9)-2*Data!D220^2*'Other Graphs'!$A$3))/D220","v":0.1999999999999999},null,null,null,182.000001,{"$f":"IF($C$4, 'Option vs Time'!$A$6*S220-EXP(-1*'Option vs Time'!$A$3*O220)*'Option vs Time'!$A$9*T220,-1*'Option vs Time'!$A$6*S220+EXP(-1*'Option vs Time'!$A$3*O220)*'Option vs Time'!$A$9*T220)","v":99.830717855343181},{"$f":"(LN('Option vs Time'!$A$6/'Option vs Time'!$A$9)+('Option vs Time'!$A$3+0.5*'Option vs Time'!$A$15^2)*O220)/('Option vs Time'!$A$15*SQRT(O220))","v":3.6746285373526333},{"$f":"Q220-'Option vs Time'!$A$15*SQRT(O220)","v":0.97648101729373193},0.99988090214667191,0.83558692482991681,5.7538767484146547E-3]
[null,null,null,183.000001,{"$f":"IF($C$4, 'Other Graphs'!$A$6*H221-EXP(-1*'Other Graphs'!$A$3*D221)*'Other Graphs'!$A$9*I221,-1*'Other Graphs'!$A$6*H221+EXP(-1*'Other Graphs'!$A$3*D221)*'Other Graphs'!$A$9*I221)","v":109.8354047495032},{"$f":"(LN('Other Graphs'!$A$6/'Other Graphs'!$A$9)+('Other Graphs'!$A$3+0.5*'Other Graphs'!$A$15^2)*D221)/('Other Graphs'!$A$15*SQRT(D221))","v":3.7201310562431802},{"$f":"F221-'Other Graphs'!$A$15*SQRT(D221)","v":1.0145811971572307},0.99990044028733926,0.84484724696142621,{"$f":"(F221*SQRT(D221)+SQRT(F221^2*D221-2*D221*LN('Other Graphs'!$A$6/'Other Graphs'!$A$9)-2*Data!D221^2*'Other Graphs'!$A$3))/D221","v":0.35000000000000003},{"$f":"(F221*SQRT(D221)-SQRT(F221^2*D221-2*D221*LN('Other Graphs'!$A$6/'Other Graphs'!$A$9)-2*Data!D221^2*'Other Graphs'!$A$3))/D221","v":0.19999999999999998},null,null,null,183.000001,{"$f":"IF($C$4, 'Option vs Time'!$A$6*S221-EXP(-1*'Option vs Time'!$A$3*O221)*'Option vs Time'!$A$9*T221,-1*'Option vs Time'!$A$6*S221+EXP(-1*'Option vs Time'!$A$3*O221)*'Option vs Time'!$A$9*T221)","v":99.836471732091596},{"$f":"(LN('Option vs Time'!$A$6/'Option vs Time'!$A$9)+('Option vs Time'!$A$3+0.5*'Option vs Time'!$A$15^2)*O221)/('Option vs Time'!$A$15*SQRT(O221))","v":3.6849034002144996},{"$f":"Q221-'Option vs Time'!$A$15*SQRT(O221)","v":0.97935354112855011},0.99988560530153336,0.83629733794749284,5.5585975467664639E-3]
[null,null,null,184.000001,{"$f":"IF($C$4, 'Other Graphs'!$A$6*H222-EXP(-1*'Other Graphs'!$A$3*D222)*'Other Graphs'!$A$9*I222,-1*'Other Graphs'!$A$6*H222+EXP(-1*'Other Graphs'!$A$3*D222)*'Other Graphs'!$A$9*I222)","v":109.84100545027941},{"$f":"(LN('Other Graphs'!$A$6/'Other Graphs'!$A$9)+('Other Graphs'!$A$3+0.5*'Other Graphs'!$A$15^2)*D222)/('Other Graphs'!$A$15*SQRT(D222))","v":3.7302815008555323},{"$f":"F222-'Other Graphs'!$A$15*SQRT(D222)","v":1.017349500233327},0.99990436702365204,0.84550640181248937,{"$f":"(F222*SQRT(D222)+SQRT(F222^2*D222-2*D222*LN('Other Graphs'!$A$6/'Other Graphs'!$A$9)-2*Data!D222^2*'Other Graphs'!$A$3))/D222","v":0.35},{"$f":"(F222*SQRT(D222)-SQRT(F222^2*D222-2*D222*LN('Other Graphs'!$A$6/'Other Graphs'!$A$9)-2*Data!D222^2*'Other Graphs'!$A$3))/D222","v":0.20000000000000004},null,null,null,184.000001,{"$f":"IF($C$4, 'Option vs Time'!$A$6*S222-EXP(-1*'Option vs Time'!$A$3*O222)*'Option vs Time'!$A$9*T222,-1*'Option vs Time'!$A$6*S222+EXP(-1*'Option vs Time'!$A$3*O222)*'Option vs Time'!$A$9*T222)","v":99.842030329638362},{"$f":"(LN('Option vs Time'!$A$6/'Option vs Time'!$A$9)+('Option vs Time'!$A$3+0.5*'Option vs Time'!$A$15^2)*O222)/('Option vs Time'!$A$15*SQRT(O222))","v":3.6951497025714373},{"$f":"Q222-'Option vs Time'!$A$15*SQRT(O222)","v":0.98221770194923197},0.99989012136569599,0.83700369575248912,5.3699345625801698E-3]
[null,null,null,185.000001,{"$f":"IF($C$4, 'Other Graphs'!$A$6*H223-EXP(-1*'Other Graphs'!$A$3*D223)*'Other Graphs'!$A$9*I223,-1*'Other Graphs'!$A$6*H223+EXP(-1*'Other Graphs'!$A$3*D223)*'Other Graphs'!$A$9*I223)","v":109.8464158147578},{"$f":"(LN('Other Graphs'!$A$6/'Other Graphs'!$A$9)+('Other Graphs'!$A$3+0.5*'Other Graphs'!$A$15^2)*D223)/('Other Graphs'!$A$15*SQRT(D223))","v":3.7404044000114482},{"$f":"F223-'Other Graphs'!$A$15*SQRT(D223)","v":1.0201102909122133},0.99990813779156651,0.84616192165547888,{"$f":"(F223*SQRT(D223)+SQRT(F223^2*D223-2*D223*LN('Other Graphs'!$A$6/'Other Graphs'!$A$9)-2*Data!D223^2*'Other Graphs'!$A$3))/D223","v":0.35000000000000003},{"$f":"(F223*SQRT(D223)-SQRT(F223^2*D223-2*D223*LN('Other Graphs'!$A$6/'Other Graphs'!$A$9)-2*Data!D223^2*'Other Graphs'!$A$3))/D223","v":0.19999999999999993},null,null,null,185.000001,{"$f":"IF($C$4, 'Option vs Time'!$A$6*S223-EXP(-1*'Option vs Time'!$A$3*O223)*'Option vs Time'!$A$9*T223,-1*'Option vs Time'!$A$6*S223+EXP(-1*'Option vs Time'!$A$3*O223)*'Option vs Time'!$A$9*T223)","v":99.847400264200942},{"$f":"(LN('Option vs Time'!$A$6/'Option vs Time'!$A$9)+('Option vs Time'!$A$3+0.5*'Option vs Time'!$A$15^2)*O223)/('Option vs Time'!$A$15*SQRT(O223))","v":3.7053676811928771},{"$f":"Q223-'Option vs Time'!$A$15*SQRT(O223)","v":0.9850735720936421},0.99989445784823094,0.83770603317046533,5.1876640614523239E-3]
[null,null,null,186.000001,{"$f":"IF($C$4, 'Other Graphs'!$A$6*H224-EXP(-1*'Other Graphs'!$A$3*D224)*'Other Graphs'!$A$9*I224,-1*'Other Graphs'!$A$6*H224+EXP(-1*'Other Graphs'!$A$3*D224)*'Other Graphs'!$A$9*I224)","v":109.85164230250463},{"$f":"(LN('Other Graphs'!$A$6/'Other Graphs'!$A$9)+('Other Graphs'!$A$3+0.5*'Other Graphs'!$A$15^2)*D224)/('Other Graphs'!$A$15*SQRT(D224))","v":3.7504999767530998},{"$f":"F224-'Other Graphs'!$A$15*SQRT(D224)","v":1.0228636300235725},0.99991175883927563,0.8468138361120322,{"$f":"(F224*SQRT(D224)+SQRT(F224^2*D224-2*D224*LN('Other Graphs'!$A$6/'Other Graphs'!$A$9)-2*Data!D224^2*'Other Graphs'!$A$3))/D224","v":0.35000000000000003},{"$f":"(F224*SQRT(D224)-SQRT(F224^2*D224-2*D224*LN('Other Graphs'!$A$6/'Other Graphs'!$A$9)-2*Data!D224^2*'Other Graphs'!$A$3))/D224","v":0.20000000000000004},null,null,null,186.000001,{"$f":"IF($C$4, 'Option vs Time'!$A$6*S224-EXP(-1*'Option vs Time'!$A$3*O224)*'Option vs Time'!$A$9*T224,-1*'Option vs Time'!$A$6*S224+EXP(-1*'Option vs Time'!$A$3*O224)*'Option vs Time'!$A$9*T224)","v":99.852587928262395},{"$f":"(LN('Option vs Time'!$A$6/'Option vs Time'!$A$9)+('Option vs Time'!$A$3+0.5*'Option vs Time'!$A$15^2)*O224)/('Option vs Time'!$A$15*SQRT(O224))","v":3.7155575695958536},{"$f":"Q224-'Option vs Time'!$A$15*SQRT(O224)","v":0.98792122286632633},0.99989862195349821,0.83840438466034484,5.0115698589650037E-3]
[null,null,null,187.000001,{"$f":"IF($C$4, 'Other Graphs'!$A$6*H225-EXP(-1*'Other Graphs'!$A$3*D225)*'Other Graphs'!$A$9*I225,-1*'Other Graphs'!$A$6*H225+EXP(-1*'Other Graphs'!$A$3*D225)*'Other Graphs'!$A$9*I225)","v":109.85669115418344},{"$f":"(LN('Other Graphs'!$A$6/'Other Graphs'!$A$9)+('Other Graphs'!$A$3+0.5*'Other Graphs'!$A$15^2)*D225)/('Other Graphs'!$A$15*SQRT(D225))","v":3.760568451128766},{"$f":"F225-'Other Graphs'!$A$15*SQRT(D225)","v":1.0256095775805734},0.99991523616202438,0.84746217443283522,{"$f":"(F225*SQRT(D225)+SQRT(F225^2*D225-2*D225*LN('Other Graphs'!$A$6/'Other Graphs'!$A$9)-2*Data!D225^2*'Other Graphs'!$A$3))/D225","v":0.3500000000000002},{"$f":"(F225*SQRT(D225)-SQRT(F225^2*D225-2*D225*LN('Other Graphs'!$A$6/'Other Graphs'!$A$9)-2*Data!D225^2*'Other Graphs'!$A$3))/D225","v":0.1999999999999999},null,null,null,187.000001,{"$f":"IF($C$4, 'Option vs Time'!$A$6*S225-EXP(-1*'Option vs Time'!$A$3*O225)*'Option vs Time'!$A$9*T225,-1*'Option vs Time'!$A$6*S225+EXP(-1*'Option vs Time'!$A$3*O225)*'Option vs Time'!$A$9*T225)","v":99.85759949812136},{"$f":"(LN('Option vs Time'!$A$6/'Option vs Time'!$A$9)+('Option vs Time'!$A$3+0.5*'Option vs Time'!$A$15^2)*O225)/('Option vs Time'!$A$15*SQRT(O225))","v":3.7257195981071938},{"$f":"Q225-'Option vs Time'!$A$15*SQRT(O225)","v":0.9907607245590011},0.99990262059368173,0.83909878422330797,4.8414430664394104E-3]
[null,null,null,188.000001,{"$f":"IF($C$4, 'Other Graphs'!$A$6*H226-EXP(-1*'Other Graphs'!$A$3*D226)*'Other Graphs'!$A$9*I226,-1*'Other Graphs'!$A$6*H226+EXP(-1*'Other Graphs'!$A$3*D226)*'Other Graphs'!$A$9*I226)","v":109.86156839896259},{"$f":"(LN('Other Graphs'!$A$6/'Other Graphs'!$A$9)+('Other Graphs'!$A$3+0.5*'Other Graphs'!$A$15^2)*D226)/('Other Graphs'!$A$15*SQRT(D226))","v":3.7706100402487928},{"$f":"F226-'Other Graphs'!$A$15*SQRT(D226)","v":1.0283481927951255},0.99991857551248386,0.84810696550426046,{"$f":"(F226*SQRT(D226)+SQRT(F226^2*D226-2*D226*LN('Other Graphs'!$A$6/'Other Graphs'!$A$9)-2*Data!D226^2*'Other Graphs'!$A$3))/D226","v":0.35000000000000009},{"$f":"(F226*SQRT(D226)-SQRT(F226^2*D226-2*D226*LN('Other Graphs'!$A$6/'Other Graphs'!$A$9)-2*Data!D226^2*'Other Graphs'!$A$3))/D226","v":0.19999999999999998},null,null,null,188.000001,{"$f":"IF($C$4, 'Option vs Time'!$A$6*S226-EXP(-1*'Option vs Time'!$A$3*O226)*'Option vs Time'!$A$9*T226,-1*'Option vs Time'!$A$6*S226+EXP(-1*'Option vs Time'!$A$3*O226)*'Option vs Time'!$A$9*T226)","v":99.862440941187799},{"$f":"(LN('Option vs Time'!$A$6/'Option vs Time'!$A$9)+('Option vs Time'!$A$3+0.5*'Option vs Time'!$A$15^2)*O226)/('Option vs Time'!$A$15*SQRT(O226))","v":3.7358539939241768},{"$f":"Q226-'Option vs Time'!$A$15*SQRT(O226)","v":0.99359214647050953},0.99990646040079956,0.83978926541146404,4.6770818455286189E-3]
[null,null,null,189.000001,{"$f":"IF($C$4, 'Other Graphs'!$A$6*H227-EXP(-1*'Other Graphs'!$A$3*D227)*'Other Graphs'!$A$9*I227,-1*'Other Graphs'!$A$6*H227+EXP(-1*'Other Graphs'!$A$3*D227)*'Other Graphs'!$A$9*I227)","v":109.86627986167225},{"$f":"(LN('Other Graphs'!$A$6/'Other Graphs'!$A$9)+('Other Graphs'!$A$3+0.5*'Other Graphs'!$A$15^2)*D227)/('Other Graphs'!$A$15*SQRT(D227))","v":3.7806249583402209},{"$f":"F227-'Other Graphs'!$A$15*SQRT(D227)","v":1.031079534092787},0.99992178241069352,0.8487482378548542,{"$f":"(F227*SQRT(D227)+SQRT(F227^2*D227-2*D227*LN('Other Graphs'!$A$6/'Other Graphs'!$A$9)-2*Data!D227^2*'Other Graphs'!$A$3))/D227","v":0.34999999999999987},{"$f":"(F227*SQRT(D227)-SQRT(F227^2*D227-2*D227*LN('Other Graphs'!$A$6/'Other Graphs'!$A$9)-2*Data!D227^2*'Other Graphs'!$A$3))/D227","v":0.20000000000000012},null,null,null,189.000001,{"$f":"IF($C$4, 'Option vs Time'!$A$6*S227-EXP(-1*'Option vs Time'!$A$3*O227)*'Option vs Time'!$A$9*T227,-1*'Option vs Time'!$A$6*S227+EXP(-1*'Option vs Time'!$A$3*O227)*'Option vs Time'!$A$9*T227)","v":99.867118023033328},{"$f":"(LN('Option vs Time'!$A$6/'Option vs Time'!$A$9)+('Option vs Time'!$A$3+0.5*'Option vs Time'!$A$15^2)*O227)/('Option vs Time'!$A$15*SQRT(O227))","v":3.7459609811737362},{"$f":"Q227-'Option vs Time'!$A$15*SQRT(O227)","v":0.99641555692630224},0.9999101477382123,0.8404758613363128,4.5182911703562922E-3]
[null,null,null,190.000001,{"$f":"IF($C$4, 'Other Graphs'!$A$6*H228-EXP(-1*'Other Graphs'!$A$3*D228)*'Other Graphs'!$A$9*I228,-1*'Other Graphs'!$A$6*H228+EXP(-1*'Other Graphs'!$A$3*D228)*'Other Graphs'!$A$9*I228)","v":109.87083116971966},{"$f":"(LN('Other Graphs'!$A$6/'Other Graphs'!$A$9)+('Other Graphs'!$A$3+0.5*'Other Graphs'!$A$15^2)*D228)/('Other Graphs'!$A$15*SQRT(D228))","v":3.7906134168001104},{"$f":"F228-'Other Graphs'!$A$15*SQRT(D228)","v":1.0338036591273037},0.99992486215358889,0.84938601966166971,{"$f":"(F228*SQRT(D228)+SQRT(F228^2*D228-2*D228*LN('Other Graphs'!$A$6/'Other Graphs'!$A$9)-2*Data!D228^2*'Other Graphs'!$A$3))/D228","v":0.35000000000000026},{"$f":"(F228*SQRT(D228)-SQRT(F228^2*D228-2*D228*LN('Other Graphs'!$A$6/'Other Graphs'!$A$9)-2*Data!D228^2*'Other Graphs'!$A$3))/D228","v":0.19999999999999982},null,null,null,190.000001,{"$f":"IF($C$4, 'Option vs Time'!$A$6*S228-EXP(-1*'Option vs Time'!$A$3*O228)*'Option vs Time'!$A$9*T228,-1*'Option vs Time'!$A$6*S228+EXP(-1*'Option vs Time'!$A$3*O228)*'Option vs Time'!$A$9*T228)","v":99.871636314203684},{"$f":"(LN('Option vs Time'!$A$6/'Option vs Time'!$A$9)+('Option vs Time'!$A$3+0.5*'Option vs Time'!$A$15^2)*O228)/('Option vs Time'!$A$15*SQRT(O228))","v":3.7560407809702143},{"$f":"Q228-'Option vs Time'!$A$15*SQRT(O228)","v":0.99923102329740754},0.99991368871165076,0.84115860467699555,4.3648825984803352E-3]
[null,null,null,191.000001,{"$f":"IF($C$4, 'Other Graphs'!$A$6*H229-EXP(-1*'Other Graphs'!$A$3*D229)*'Other Graphs'!$A$9*I229,-1*'Other Graphs'!$A$6*H229+EXP(-1*'Other Graphs'!$A$3*D229)*'Other Graphs'!$A$9*I229)","v":109.8752277597706},{"$f":"(LN('Other Graphs'!$A$6/'Other Graphs'!$A$9)+('Other Graphs'!$A$3+0.5*'Other Graphs'!$A$15^2)*D229)/('Other Graphs'!$A$15*SQRT(D229))","v":3.8005756242475961},{"$f":"F229-'Other Graphs'!$A$15*SQRT(D229)","v":1.0365206247947993},0.99992781982413326,0.85002033875645278,{"$f":"(F229*SQRT(D229)+SQRT(F229^2*D229-2*D229*LN('Other Graphs'!$A$6/'Other Graphs'!$A$9)-2*Data!D229^2*'Other Graphs'!$A$3))/D229","v":0.35000000000000014},{"$f":"(F229*SQRT(D229)-SQRT(F229^2*D229-2*D229*LN('Other Graphs'!$A$6/'Other Graphs'!$A$9)-2*Data!D229^2*'Other Graphs'!$A$3))/D229","v":0.19999999999999987},null,null,null,191.000001,{"$f":"IF($C$4, 'Option vs Time'!$A$6*S229-EXP(-1*'Option vs Time'!$A$3*O229)*'Option vs Time'!$A$9*T229,-1*'Option vs Time'!$A$6*S229+EXP(-1*'Option vs Time'!$A$3*O229)*'Option vs Time'!$A$9*T229)","v":99.876001196802164},{"$f":"(LN('Option vs Time'!$A$6/'Option vs Time'!$A$9)+('Option vs Time'!$A$3+0.5*'Option vs Time'!$A$15^2)*O229)/('Option vs Time'!$A$15*SQRT(O229))","v":3.7660936114717307},{"$f":"Q229-'Option vs Time'!$A$15*SQRT(O229)","v":1.002038612018934},0.99991708917978317,0.84183752768834486,4.2166740488482901E-3]
[null,null,null,192.000001,{"$f":"IF($C$4, 'Other Graphs'!$A$6*H230-EXP(-1*'Other Graphs'!$A$3*D230)*'Other Graphs'!$A$9*I230,-1*'Other Graphs'!$A$6*H230+EXP(-1*'Other Graphs'!$A$3*D230)*'Other Graphs'!$A$9*I230)","v":109.87947488420491},{"$f":"(LN('Other Graphs'!$A$6/'Other Graphs'!$A$9)+('Other Graphs'!$A$3+0.5*'Other Graphs'!$A$15^2)*D230)/('Other Graphs'!$A$15*SQRT(D230))","v":3.8105117865747378},{"$f":"F230-'Other Graphs'!$A$15*SQRT(D230)","v":1.0392304872476554},0.99993066030006872,0.85065122263169024,{"$f":"(F230*SQRT(D230)+SQRT(F230^2*D230-2*D230*LN('Other Graphs'!$A$6/'Other Graphs'!$A$9)-2*Data!D230^2*'Other Graphs'!$A$3))/D230","v":0.35000000000000003},{"$f":"(F230*SQRT(D230)-SQRT(F230^2*D230-2*D230*LN('Other Graphs'!$A$6/'Other Graphs'!$A$9)-2*Data!D230^2*'Other Graphs'!$A$3))/D230","v":0.2},null,null,null,192.000001,{"$f":"IF($C$4, 'Option vs Time'!$A$6*S230-EXP(-1*'Option vs Time'!$A$3*O230)*'Option vs Time'!$A$9*T230,-1*'Option vs Time'!$A$6*S230+EXP(-1*'Option vs Time'!$A$3*O230)*'Option vs Time'!$A$9*T230)","v":99.880217870851013},{"$f":"(LN('Option vs Time'!$A$6/'Option vs Time'!$A$9)+('Option vs Time'!$A$3+0.5*'Option vs Time'!$A$15^2)*O230)/('Option vs Time'!$A$15*SQRT(O230))","v":3.7761196879352137},{"$f":"Q230-'Option vs Time'!$A$15*SQRT(O230)","v":1.0048383886081313},0.99992035476434216,0.84251266220874399,4.0734895876823884E-3]
[null,null,null,193.000001,{"$f":"IF($C$4, 'Other Graphs'!$A$6*H231-EXP(-1*'Other Graphs'!$A$3*D231)*'Other Graphs'!$A$9*I231,-1*'Other Graphs'!$A$6*H231+EXP(-1*'Other Graphs'!$A$3*D231)*'Other Graphs'!$A$9*I231)","v":109.88357761735412},{"$f":"(LN('Other Graphs'!$A$6/'Other Graphs'!$A$9)+('Other Graphs'!$A$3+0.5*'Other Graphs'!$A$15^2)*D231)/('Other Graphs'!$A$15*SQRT(D231))","v":3.8204221069961632},{"$f":"F231-'Other Graphs'!$A$15*SQRT(D231)","v":1.041933301908045},{"$f":"IF($C$4,NORMSDIST(F231),NORMSDIST(-1*F231))","v":0.99993338826230516},{"$f":"IF($C$4,NORMSDIST(G231),NORMSDIST(-1*G231))","v":0.85127869844651549},{"$f":"(F231*SQRT(D231)+SQRT(F231^2*D231-2*D231*LN('Other Graphs'!$A$6/'Other Graphs'!$A$9)-2*Data!D231^2*'Other Graphs'!$A$3))/D231","v":0.35000000000000009},{"$f":"(F231*SQRT(D231)-SQRT(F231^2*D231-2*D231*LN('Other Graphs'!$A$6/'Other Graphs'!$A$9)-2*Data!D231^2*'Other Graphs'!$A$3))/D231","v":0.1999999999999999},null,null,null,193.000001,{"$f":"IF($C$4, 'Option vs Time'!$A$6*S231-EXP(-1*'Option vs Time'!$A$3*O231)*'Option vs Time'!$A$9*T231,-1*'Option vs Time'!$A$6*S231+EXP(-1*'Option vs Time'!$A$3*O231)*'Option vs Time'!$A$9*T231)","v":99.884291360438695},{"$f":"(LN('Option vs Time'!$A$6/'Option vs Time'!$A$9)+('Option vs Time'!$A$3+0.5*'Option vs Time'!$A$15^2)*O231)/('Option vs Time'!$A$15*SQRT(O231))","v":3.7861192227701093},{"$f":"Q231-'Option vs Time'!$A$15*SQRT(O231)","v":1.007630417681991},{"$f":"IF($C$4,NORMSDIST(Q231),NORMSDIST(-1*Q231))","v":0.99992349085982979},{"$f":"IF($C$4,NORMSDIST(R231),NORMSDIST(-1*R231))","v":0.84318403966779198},{"$f":"(P232-P231)/(O232-O231)","v":3.9351592213279218E-3}]
[null,null,null,194.000001,{"$f":"IF($C$4, 'Other Graphs'!$A$6*H232-EXP(-1*'Other Graphs'!$A$3*D232)*'Other Graphs'!$A$9*I232,-1*'Other Graphs'!$A$6*H232+EXP(-1*'Other Graphs'!$A$3*D232)*'Other Graphs'!$A$9*I232)","v":109.88754086152795},{"$f":"(LN('Other Graphs'!$A$6/'Other Graphs'!$A$9)+('Other Graphs'!$A$3+0.5*'Other Graphs'!$A$15^2)*D232)/('Other Graphs'!$A$15*SQRT(D232))","v":3.830306786097557},{"$f":"F232-'Other Graphs'!$A$15*SQRT(D232)","v":1.0446291234811511},0.9999360082029598,0.85190279303247995,{"$f":"(F232*SQRT(D232)+SQRT(F232^2*D232-2*D232*LN('Other Graphs'!$A$6/'Other Graphs'!$A$9)-2*Data!D232^2*'Other Graphs'!$A$3))/D232","v":0.34999999999999987},{"$f":"(F232*SQRT(D232)-SQRT(F232^2*D232-2*D232*LN('Other Graphs'!$A$6/'Other Graphs'!$A$9)-2*Data!D232^2*'Other Graphs'!$A$3))/D232","v":0.20000000000000015},null,null,null,194.000001,{"$f":"IF($C$4, 'Option vs Time'!$A$6*S232-EXP(-1*'Option vs Time'!$A$3*O232)*'Option vs Time'!$A$9*T232,-1*'Option vs Time'!$A$6*S232+EXP(-1*'Option vs Time'!$A$3*O232)*'Option vs Time'!$A$9*T232)","v":99.888226519660023},{"$f":"(LN('Option vs Time'!$A$6/'Option vs Time'!$A$9)+('Option vs Time'!$A$3+0.5*'Option vs Time'!$A$15^2)*O232)/('Option vs Time'!$A$15*SQRT(O232))","v":3.7960924255908188},{"$f":"Q232-'Option vs Time'!$A$15*SQRT(O232)","v":1.0104147629744129},0.99992650264281857,0.84385169109378588,3.8015186961359859E-3]
[null,null,null,195.000001,{"$f":"IF($C$4, 'Other Graphs'!$A$6*H233-EXP(-1*'Other Graphs'!$A$3*D233)*'Other Graphs'!$A$9*I233,-1*'Other Graphs'!$A$6*H233+EXP(-1*'Other Graphs'!$A$3*D233)*'Other Graphs'!$A$9*I233)","v":109.89136935283717},{"$f":"(LN('Other Graphs'!$A$6/'Other Graphs'!$A$9)+('Other Graphs'!$A$3+0.5*'Other Graphs'!$A$15^2)*D233)/('Other Graphs'!$A$15*SQRT(D233))","v":3.8401660218830385},{"$f":"F233-'Other Graphs'!$A$15*SQRT(D233)","v":1.0473180059681013},0.99993852443306364,0.85252353289919824,{"$f":"(F233*SQRT(D233)+SQRT(F233^2*D233-2*D233*LN('Other Graphs'!$A$6/'Other Graphs'!$A$9)-2*Data!D233^2*'Other Graphs'!$A$3))/D233","v":0.35},{"$f":"(F233*SQRT(D233)-SQRT(F233^2*D233-2*D233*LN('Other Graphs'!$A$6/'Other Graphs'!$A$9)-2*Data!D233^2*'Other Graphs'!$A$3))/D233","v":0.20000000000000004},null,null,null,195.000001,{"$f":"IF($C$4, 'Option vs Time'!$A$6*S233-EXP(-1*'Option vs Time'!$A$3*O233)*'Option vs Time'!$A$9*T233,-1*'Option vs Time'!$A$6*S233+EXP(-1*'Option vs Time'!$A$3*O233)*'Option vs Time'!$A$9*T233)","v":99.892028038356159},{"$f":"(LN('Option vs Time'!$A$6/'Option vs Time'!$A$9)+('Option vs Time'!$A$3+0.5*'Option vs Time'!$A$15^2)*O233)/('Option vs Time'!$A$15*SQRT(O233))","v":3.8060395032679168},{"$f":"Q233-'Option vs Time'!$A$15*SQRT(O233)","v":1.0131914873529797},0.99992939508086565,0.84451564712102956,3.6724093050821693E-3]
[null,null,null,196.000001,{"$f":"IF($C$4, 'Other Graphs'!$A$6*H234-EXP(-1*'Other Graphs'!$A$3*D234)*'Other Graphs'!$A$9*I234,-1*'Other Graphs'!$A$6*H234+EXP(-1*'Other Graphs'!$A$3*D234)*'Other Graphs'!$A$9*I234)","v":109.89506766681974},{"$f":"(LN('Other Graphs'!$A$6/'Other Graphs'!$A$9)+('Other Graphs'!$A$3+0.5*'Other Graphs'!$A$15^2)*D234)/('Other Graphs'!$A$15*SQRT(D234))","v":3.8500000098214291},{"$f":"F234-'Other Graphs'!$A$15*SQRT(D234)","v":1.0500000026785719},0.99994094108994924,0.85314094423985998,{"$f":"(F234*SQRT(D234)+SQRT(F234^2*D234-2*D234*LN('Other Graphs'!$A$6/'Other Graphs'!$A$9)-2*Data!D234^2*'Other Graphs'!$A$3))/D234","v":0.35000000000000009},{"$f":"(F234*SQRT(D234)-SQRT(F234^2*D234-2*D234*LN('Other Graphs'!$A$6/'Other Graphs'!$A$9)-2*Data!D234^2*'Other Graphs'!$A$3))/D234","v":0.19999999999999996},null,null,null,196.000001,{"$f":"IF($C$4, 'Option vs Time'!$A$6*S234-EXP(-1*'Option vs Time'!$A$3*O234)*'Option vs Time'!$A$9*T234,-1*'Option vs Time'!$A$6*S234+EXP(-1*'Option vs Time'!$A$3*O234)*'Option vs Time'!$A$9*T234)","v":99.895700447661241},{"$f":"(LN('Option vs Time'!$A$6/'Option vs Time'!$A$9)+('Option vs Time'!$A$3+0.5*'Option vs Time'!$A$15^2)*O234)/('Option vs Time'!$A$15*SQRT(O234))","v":3.8159606599781482},{"$f":"Q234-'Option vs Time'!$A$15*SQRT(O234)","v":1.0159606528352909},0.99993217294105696,0.84517593799696156,3.5476777008938143E-3]
[null,null,null,197.000001,{"$f":"IF($C$4, 'Other Graphs'!$A$6*H235-EXP(-1*'Other Graphs'!$A$3*D235)*'Other Graphs'!$A$9*I235,-1*'Other Graphs'!$A$6*H235+EXP(-1*'Other Graphs'!$A$3*D235)*'Other Graphs'!$A$9*I235)","v":109.89864022387665},{"$f":"(LN('Other Graphs'!$A$6/'Other Graphs'!$A$9)+('Other Graphs'!$A$3+0.5*'Other Graphs'!$A$15^2)*D235)/('Other Graphs'!$A$15*SQRT(D235))","v":3.8598089428914748},{"$f":"F235-'Other Graphs'!$A$15*SQRT(D235)","v":1.0526751662431297},0.99994326214433171,0.8537550529366229,{"$f":"(F235*SQRT(D235)+SQRT(F235^2*D235-2*D235*LN('Other Graphs'!$A$6/'Other Graphs'!$A$9)-2*Data!D235^2*'Other Graphs'!$A$3))/D235","v":0.35000000000000003},{"$f":"(F235*SQRT(D235)-SQRT(F235^2*D235-2*D235*LN('Other Graphs'!$A$6/'Other Graphs'!$A$9)-2*Data!D235^2*'Other Graphs'!$A$3))/D235","v":0.2},null,null,null,197.000001,{"$f":"IF($C$4, 'Option vs Time'!$A$6*S235-EXP(-1*'Option vs Time'!$A$3*O235)*'Option vs Time'!$A$9*T235,-1*'Option vs Time'!$A$6*S235+EXP(-1*'Option vs Time'!$A$3*O235)*'Option vs Time'!$A$9*T235)","v":99.899248125362135},{"$f":"(LN('Option vs Time'!$A$6/'Option vs Time'!$A$9)+('Option vs Time'!$A$3+0.5*'Option vs Time'!$A$15^2)*O235)/('Option vs Time'!$A$15*SQRT(O235))","v":3.825856097253272},{"$f":"Q235-'Option vs Time'!$A$15*SQRT(O235)","v":1.018722320604927},0.9999348407981965,0.84583259358912066,3.4271757153732096E-3]
[null,null,null,198.000001,{"$f":"IF($C$4, 'Other Graphs'!$A$6*H236-EXP(-1*'Other Graphs'!$A$3*D236)*'Other Graphs'!$A$9*I236,-1*'Other Graphs'!$A$6*H236+EXP(-1*'Other Graphs'!$A$3*D236)*'Other Graphs'!$A$9*I236)","v":109.90209129452401},{"$f":"(LN('Other Graphs'!$A$6/'Other Graphs'!$A$9)+('Other Graphs'!$A$3+0.5*'Other Graphs'!$A$15^2)*D236)/('Other Graphs'!$A$15*SQRT(D236))","v":3.8695930116260291},{"$f":"F236-'Other Graphs'!$A$15*SQRT(D236)","v":1.0553435486252805},0.9999454914070971,0.85436588456588436,{"$f":"(F236*SQRT(D236)+SQRT(F236^2*D236-2*D236*LN('Other Graphs'!$A$6/'Other Graphs'!$A$9)-2*Data!D236^2*'Other Graphs'!$A$3))/D236","v":0.35000000000000003},{"$f":"(F236*SQRT(D236)-SQRT(F236^2*D236-2*D236*LN('Other Graphs'!$A$6/'Other Graphs'!$A$9)-2*Data!D236^2*'Other Graphs'!$A$3))/D236","v":0.20000000000000007},null,null,null,198.000001,{"$f":"IF($C$4, 'Option vs Time'!$A$6*S236-EXP(-1*'Option vs Time'!$A$3*O236)*'Option vs Time'!$A$9*T236,-1*'Option vs Time'!$A$6*S236+EXP(-1*'Option vs Time'!$A$3*O236)*'Option vs Time'!$A$9*T236)","v":99.902675301077508},{"$f":"(LN('Option vs Time'!$A$6/'Option vs Time'!$A$9)+('Option vs Time'!$A$3+0.5*'Option vs Time'!$A$15^2)*O236)/('Option vs Time'!$A$15*SQRT(O236))","v":3.8357260140277778},{"$f":"Q236-'Option vs Time'!$A$15*SQRT(O236)","v":1.0214765510270292},0.99993740304265599,0.84648564339194798,3.3107601849735602E-3]
[null,null,null,199.000001,{"$f":"IF($C$4, 'Other Graphs'!$A$6*H237-EXP(-1*'Other Graphs'!$A$3*D237)*'Other Graphs'!$A$9*I237,-1*'Other Graphs'!$A$6*H237+EXP(-1*'Other Graphs'!$A$3*D237)*'Other Graphs'!$A$9*I237)","v":109.90542500446767},{"$f":"(LN('Other Graphs'!$A$6/'Other Graphs'!$A$9)+('Other Graphs'!$A$3+0.5*'Other Graphs'!$A$15^2)*D237)/('Other Graphs'!$A$15*SQRT(D237))","v":3.879352404155235},{"$f":"F237-'Other Graphs'!$A$15*SQRT(D237)","v":1.0580052011332457},0.99994763253581065,0.85497346440343636,{"$f":"(F237*SQRT(D237)+SQRT(F237^2*D237-2*D237*LN('Other Graphs'!$A$6/'Other Graphs'!$A$9)-2*Data!D237^2*'Other Graphs'!$A$3))/D237","v":0.35000000000000009},{"$f":"(F237*SQRT(D237)-SQRT(F237^2*D237-2*D237*LN('Other Graphs'!$A$6/'Other Graphs'!$A$9)-2*Data!D237^2*'Other Graphs'!$A$3))/D237","v":0.2},null,null,null,199.000001,{"$f":"IF($C$4, 'Option vs Time'!$A$6*S237-EXP(-1*'Option vs Time'!$A$3*O237)*'Option vs Time'!$A$9*T237,-1*'Option vs Time'!$A$6*S237+EXP(-1*'Option vs Time'!$A$3*O237)*'Option vs Time'!$A$9*T237)","v":99.905986061262482},{"$f":"(LN('Option vs Time'!$A$6/'Option vs Time'!$A$9)+('Option vs Time'!$A$3+0.5*'Option vs Time'!$A$15^2)*O237)/('Option vs Time'!$A$15*SQRT(O237))","v":3.845570606685488},{"$f":"Q237-'Option vs Time'!$A$15*SQRT(O237)","v":1.0242234036634987},0.99993986388789935,0.84713511653342743,3.198292782030876E-3]
[null,null,null,200.000001,{"$f":"IF($C$4, 'Other Graphs'!$A$6*H238-EXP(-1*'Other Graphs'!$A$3*D238)*'Other Graphs'!$A$9*I238,-1*'Other Graphs'!$A$6*H238+EXP(-1*'Other Graphs'!$A$3*D238)*'Other Graphs'!$A$9*I238)","v":109.90864533950615},{"$f":"(LN('Other Graphs'!$A$6/'Other Graphs'!$A$9)+('Other Graphs'!$A$3+0.5*'Other Graphs'!$A$15^2)*D238)/('Other Graphs'!$A$15*SQRT(D238))","v":3.8890873062487299},{"$f":"F238-'Other Graphs'!$A$15*SQRT(D238)","v":1.0606601744314719},0.99994968904095549,0.85557781742950556,{"$f":"(F238*SQRT(D238)+SQRT(F238^2*D238-2*D238*LN('Other Graphs'!$A$6/'Other Graphs'!$A$9)-2*Data!D238^2*'Other Graphs'!$A$3))/D238","v":0.35000000000000009},{"$f":"(F238*SQRT(D238)-SQRT(F238^2*D238-2*D238*LN('Other Graphs'!$A$6/'Other Graphs'!$A$9)-2*Data!D238^2*'Other Graphs'!$A$3))/D238","v":0.19999999999999998},null,null,null,200.000001,{"$f":"IF($C$4, 'Option vs Time'!$A$6*S238-EXP(-1*'Option vs Time'!$A$3*O238)*'Option vs Time'!$A$9*T238,-1*'Option vs Time'!$A$6*S238+EXP(-1*'Option vs Time'!$A$3*O238)*'Option vs Time'!$A$9*T238)","v":99.909184354044513},{"$f":"(LN('Option vs Time'!$A$6/'Option vs Time'!$A$9)+('Option vs Time'!$A$3+0.5*'Option vs Time'!$A$15^2)*O238)/('Option vs Time'!$A$15*SQRT(O238))","v":3.8553900691050988},{"$f":"Q238-'Option vs Time'!$A$15*SQRT(O238)","v":1.0269629372878408},0.99994222737769534,0.8477810417815741,3.0896398517938906E-3]
[null,null,null,201.000001,{"$f":"IF($C$4, 'Other Graphs'!$A$6*H239-EXP(-1*'Other Graphs'!$A$3*D239)*'Other Graphs'!$A$9*I239,-1*'Other Graphs'!$A$6*H239+EXP(-1*'Other Graphs'!$A$3*D239)*'Other Graphs'!$A$9*I239)","v":109.91175615026792},{"$f":"(LN('Other Graphs'!$A$6/'Other Graphs'!$A$9)+('Other Graphs'!$A$3+0.5*'Other Graphs'!$A$15^2)*D239)/('Other Graphs'!$A$15*SQRT(D239))","v":3.8987979013569043},{"$f":"F239-'Other Graphs'!$A$15*SQRT(D239)","v":1.0633085185518829},0.99995166429191429,0.85617896833368412,{"$f":"(F239*SQRT(D239)+SQRT(F239^2*D239-2*D239*LN('Other Graphs'!$A$6/'Other Graphs'!$A$9)-2*Data!D239^2*'Other Graphs'!$A$3))/D239","v":0.35000000000000009},{"$f":"(F239*SQRT(D239)-SQRT(F239^2*D239-2*D239*LN('Other Graphs'!$A$6/'Other Graphs'!$A$9)-2*Data!D239^2*'Other Graphs'!$A$3))/D239","v":0.19999999999999993},null,null,null,201.000001,{"$f":"IF($C$4, 'Option vs Time'!$A$6*S239-EXP(-1*'Option vs Time'!$A$3*O239)*'Option vs Time'!$A$9*T239,-1*'Option vs Time'!$A$6*S239+EXP(-1*'Option vs Time'!$A$3*O239)*'Option vs Time'!$A$9*T239)","v":99.912273993896306},{"$f":"(LN('Option vs Time'!$A$6/'Option vs Time'!$A$9)+('Option vs Time'!$A$3+0.5*'Option vs Time'!$A$15^2)*O239)/('Option vs Time'!$A$15*SQRT(O239))","v":3.8651845927046815},{"$f":"Q239-'Option vs Time'!$A$15*SQRT(O239)","v":1.0296952098996601},0.99994449739303193,0.8484234475507737,2.9846722549962124E-3]
[null,null,null,202.000001,{"$f":"IF($C$4, 'Other Graphs'!$A$6*H240-EXP(-1*'Other Graphs'!$A$3*D240)*'Other Graphs'!$A$9*I240,-1*'Other Graphs'!$A$6*H240+EXP(-1*'Other Graphs'!$A$3*D240)*'Other Graphs'!$A$9*I240)","v":109.91476115678846},{"$f":"(LN('Other Graphs'!$A$6/'Other Graphs'!$A$9)+('Other Graphs'!$A$3+0.5*'Other Graphs'!$A$15^2)*D240)/('Other Graphs'!$A$15*SQRT(D240))","v":3.9084843706512378},{"$f":"F240-'Other Graphs'!$A$15*SQRT(D240)","v":1.065950282904883},0.9999535615227042,0.85677694151975348,{"$f":"(F240*SQRT(D240)+SQRT(F240^2*D240-2*D240*LN('Other Graphs'!$A$6/'Other Graphs'!$A$9)-2*Data!D240^2*'Other Graphs'!$A$3))/D240","v":0.35000000000000003},{"$f":"(F240*SQRT(D240)-SQRT(F240^2*D240-2*D240*LN('Other Graphs'!$A$6/'Other Graphs'!$A$9)-2*Data!D240^2*'Other Graphs'!$A$3))/D240","v":0.19999999999999998},null,null,null,202.000001,{"$f":"IF($C$4, 'Option vs Time'!$A$6*S240-EXP(-1*'Option vs Time'!$A$3*O240)*'Option vs Time'!$A$9*T240,-1*'Option vs Time'!$A$6*S240+EXP(-1*'Option vs Time'!$A$3*O240)*'Option vs Time'!$A$9*T240)","v":99.915258666151303},{"$f":"(LN('Option vs Time'!$A$6/'Option vs Time'!$A$9)+('Option vs Time'!$A$3+0.5*'Option vs Time'!$A$15^2)*O240)/('Option vs Time'!$A$15*SQRT(O240))","v":3.87495436648517},{"$f":"Q240-'Option vs Time'!$A$15*SQRT(O240)","v":1.0324202787388153},0.99994667765874534,0.84906236190797524,2.8832652154449079E-3]
[null,null,null,203.000001,{"$f":"IF($C$4, 'Other Graphs'!$A$6*H241-EXP(-1*'Other Graphs'!$A$3*D241)*'Other Graphs'!$A$9*I241,-1*'Other Graphs'!$A$6*H241+EXP(-1*'Other Graphs'!$A$3*D241)*'Other Graphs'!$A$9*I241)","v":109.91766395293254},{"$f":"(LN('Other Graphs'!$A$6/'Other Graphs'!$A$9)+('Other Graphs'!$A$3+0.5*'Other Graphs'!$A$15^2)*D241)/('Other Graphs'!$A$15*SQRT(D241))","v":3.9181468930637355},{"$f":"F241-'Other Graphs'!$A$15*SQRT(D241)","v":1.0685855162901099},0.9999553838374754,0.85737176111040192,{"$f":"(F241*SQRT(D241)+SQRT(F241^2*D241-2*D241*LN('Other Graphs'!$A$6/'Other Graphs'!$A$9)-2*Data!D241^2*'Other Graphs'!$A$3))/D241","v":0.35000000000000026},{"$f":"(F241*SQRT(D241)-SQRT(F241^2*D241-2*D241*LN('Other Graphs'!$A$6/'Other Graphs'!$A$9)-2*Data!D241^2*'Other Graphs'!$A$3))/D241","v":0.19999999999999987},null,null,null,203.000001,{"$f":"IF($C$4, 'Option vs Time'!$A$6*S241-EXP(-1*'Option vs Time'!$A$3*O241)*'Option vs Time'!$A$9*T241,-1*'Option vs Time'!$A$6*S241+EXP(-1*'Option vs Time'!$A$3*O241)*'Option vs Time'!$A$9*T241)","v":99.918141931366748},{"$f":"(LN('Option vs Time'!$A$6/'Option vs Time'!$A$9)+('Option vs Time'!$A$3+0.5*'Option vs Time'!$A$15^2)*O241)/('Option vs Time'!$A$15*SQRT(O241))","v":3.8846995770728658},{"$f":"Q241-'Option vs Time'!$A$15*SQRT(O241)","v":1.0351382002992402},0.99994877174987429,0.84969781257874255,2.7852981732507942E-3]
[null,null,null,204.000001,{"$f":"IF($C$4, 'Other Graphs'!$A$6*H242-EXP(-1*'Other Graphs'!$A$3*D242)*'Other Graphs'!$A$9*I242,-1*'Other Graphs'!$A$6*H242+EXP(-1*'Other Graphs'!$A$3*D242)*'Other Graphs'!$A$9*I242)","v":109.92046801066704},{"$f":"(LN('Other Graphs'!$A$6/'Other Graphs'!$A$9)+('Other Graphs'!$A$3+0.5*'Other Graphs'!$A$15^2)*D242)/('Other Graphs'!$A$15*SQRT(D242))","v":3.9277856453254931},{"$f":"F242-'Other Graphs'!$A$15*SQRT(D242)","v":1.0712142669069524},0.99995713421578314,0.85796345095184035,{"$f":"(F242*SQRT(D242)+SQRT(F242^2*D242-2*D242*LN('Other Graphs'!$A$6/'Other Graphs'!$A$9)-2*Data!D242^2*'Other Graphs'!$A$3))/D242","v":0.34999999999999992},{"$f":"(F242*SQRT(D242)-SQRT(F242^2*D242-2*D242*LN('Other Graphs'!$A$6/'Other Graphs'!$A$9)-2*Data!D242^2*'Other Graphs'!$A$3))/D242","v":0.20000000000000009},null,null,null,204.000001,{"$f":"IF($C$4, 'Option vs Time'!$A$6*S242-EXP(-1*'Option vs Time'!$A$3*O242)*'Option vs Time'!$A$9*T242,-1*'Option vs Time'!$A$6*S242+EXP(-1*'Option vs Time'!$A$3*O242)*'Option vs Time'!$A$9*T242)","v":99.920927229539998},{"$f":"(LN('Option vs Time'!$A$6/'Option vs Time'!$A$9)+('Option vs Time'!$A$3+0.5*'Option vs Time'!$A$15^2)*O242)/('Option vs Time'!$A$15*SQRT(O242))","v":3.8944204087609893},{"$f":"Q242-'Option vs Time'!$A$15*SQRT(O242)","v":1.0378490303424486},0.99995078309775265,0.85032982695316928]
[]
[null,null,null,"Rho data",null,null,null,null,null,null,null,null,"Vega data"]
[]
[null,null,null,"r","C","d1","d2","N(d1)","N(d2)","dc/dr",null,null,"sigma","C","d1","d2","N(d1)","N(d2)","dC/d(sigma)"]
[null,null,null,0,{"$f":"IF($C$4, 'Other Graphs'!$A$6*H247-EXP(-1*'Other Graphs'!$A$12*D247)*'Other Graphs'!$A$9*I247,-1*'Other Graphs'!$A$6*H247+EXP(-1*'Other Graphs'!$A$12*D247)*'Other Graphs'!$A$9*I247)","v":15.126074685048621},{"$f":"(LN('Other Graphs'!$A$6/'Other Graphs'!$A$9)+(D247+0.5*'Other Graphs'!$A$15^2)*'Other Graphs'!$A$12)/('Other Graphs'!$A$15*SQRT('Other Graphs'!$A$12))","v":0.17320508075688776},{"$f":"F247-'Other Graphs'!$A$15*SQRT('Other Graphs'!$A$12)","v":-0.1732050807568877},{"$f":"IF($C$4,NORMSDIST(F247),NORMSDIST(-1*F247))","v":0.56875488493203918},{"$f":"IF($C$4,NORMSDIST(G247),NORMSDIST(-1*G247))","v":0.43124511506796082},{"$f":"(E248-E247)/(D248-D247)","v":144.0353611978054},null,null,0,{"$f":"IF($C$4, 'Other Graphs'!$A$6*Q247-EXP(-1*'Other Graphs'!$A$12*'Other Graphs'!$A$3)*'Other Graphs'!$A$9*R247,-1*'Other Graphs'!$A$6*Q247+EXP(-1*'Other Graphs'!$A$12*'Other Graphs'!$A$3)*'Other Graphs'!$A$9*R247)","v":{"$error":"#DIV/0!"}},{"$f":"(LN('Other Graphs'!$A$6/'Other Graphs'!$A$9)+('Other Graphs'!$A$3+0.5*M247^2)*'Other Graphs'!$A$12)/(M247*SQRT('Other Graphs'!$A$12))","v":{"$error":"#DIV/0!"}},{"$f":"O247-M247*SQRT('Other Graphs'!$A$12)","v":{"$error":"#DIV/0!"}},{"$f":"IF($C$4,NORMSDIST(O247),NORMSDIST(-1*O247))","v":{"$error":"#DIV/0!"}},{"$f":"IF($C$4,NORMSDIST(P247),NORMSDIST(-1*P247))","v":{"$error":"#DIV/0!"}},{"$f":"(N248-N247)/(M248-M247)","v":{"$error":"#DIV/0!"}}]
[null,null,null,{"$f":"D247+0.005","v":5.0000000000000001E-3},{"$f":"IF($C$4, 'Other Graphs'!$A$6*H248-EXP(-1*'Other Graphs'!$A$12*D248)*'Other Graphs'!$A$9*I248,-1*'Other Graphs'!$A$6*H248+EXP(-1*'Other Graphs'!$A$12*D248)*'Other Graphs'!$A$9*I248)","v":15.846251491037648},{"$f":"(LN('Other Graphs'!$A$6/'Other Graphs'!$A$9)+(D248+0.5*'Other Graphs'!$A$15^2)*'Other Graphs'!$A$12)/('Other Graphs'!$A$15*SQRT('Other Graphs'!$A$12))","v":0.2165063509461097},{"$f":"F248-'Other Graphs'!$A$15*SQRT('Other Graphs'!$A$12)","v":-0.12990381056766576},{"$f":"IF($C$4,NORMSDIST(F248),NORMSDIST(-1*F248))","v":0.58570346239067672},{"$f":"IF($C$4,NORMSDIST(G248),NORMSDIST(-1*G248))","v":0.44832126472035888},{"$f":"(E249-E248)/(D249-D248)","v":147.41710784776529},null,null,{"$f":"M247+0.005","v":5.0000000000000001E-3},{"$f":"IF($C$4, 'Other Graphs'!$A$6*Q248-EXP(-1*'Other Graphs'!$A$12*'Other Graphs'!$A$3)*'Other Graphs'!$A$9*R248,-1*'Other Graphs'!$A$6*Q248+EXP(-1*'Other Graphs'!$A$12*'Other Graphs'!$A$3)*'Other Graphs'!$A$9*R248)","v":10.964302515510781},{"$f":"(LN('Other Graphs'!$A$6/'Other Graphs'!$A$9)+('Other Graphs'!$A$3+0.5*M248^2)*'Other Graphs'!$A$12)/(M248*SQRT('Other Graphs'!$A$12))","v":12.128685780001064},{"$f":"O248-M248*SQRT('Other Graphs'!$A$12)","v":12.12002552596322},{"$f":"IF($C$4,NORMSDIST(O248),NORMSDIST(-1*O248))","v":1},{"$f":"IF($C$4,NORMSDIST(P248),NORMSDIST(-1*P248))","v":1},{"$f":"(N249-N248)/(M249-M248)","v":3.8113512346171774E-8}]
[null,null,null,{"$f":"D248+0.005","v":0.01},{"$f":"IF($C$4, 'Other Graphs'!$A$6*H249-EXP(-1*'Other Graphs'!$A$12*D249)*'Other Graphs'!$A$9*I249,-1*'Other Graphs'!$A$6*H249+EXP(-1*'Other Graphs'!$A$12*D249)*'Other Graphs'!$A$9*I249)","v":16.583337030276475},{"$f":"(LN('Other Graphs'!$A$6/'Other Graphs'!$A$9)+(D249+0.5*'Other Graphs'!$A$15^2)*'Other Graphs'!$A$12)/('Other Graphs'!$A$15*SQRT('Other Graphs'!$A$12))","v":0.25980762113533168},{"$f":"F249-'Other Graphs'!$A$15*SQRT('Other Graphs'!$A$12)","v":-8.6602540378443782E-2},0.60249391401788099,0.46549372327978356,150.69181603355023,null,null,0.01,{"$f":"IF($C$4, 'Other Graphs'!$A$6*Q249-EXP(-1*'Other Graphs'!$A$12*'Other Graphs'!$A$3)*'Other Graphs'!$A$9*R249,-1*'Other Graphs'!$A$6*Q249+EXP(-1*'Other Graphs'!$A$12*'Other Graphs'!$A$3)*'Other Graphs'!$A$9*R249)","v":10.964302515701348},{"$f":"(LN('Other Graphs'!$A$6/'Other Graphs'!$A$9)+('Other Graphs'!$A$3+0.5*M249^2)*'Other Graphs'!$A$12)/(M249*SQRT('Other Graphs'!$A$12))","v":6.0708380805289162},{"$f":"O249-M249*SQRT('Other Graphs'!$A$12)","v":6.0535175724532273},0.99999999936377781,0.99999999929141703,3.2219308792491579E-3]
[null,null,null,1.4999999999999999E-2,{"$f":"IF($C$4, 'Other Graphs'!$A$6*H250-EXP(-1*'Other Graphs'!$A$12*D250)*'Other Graphs'!$A$9*I250,-1*'Other Graphs'!$A$6*H250+EXP(-1*'Other Graphs'!$A$12*D250)*'Other Graphs'!$A$9*I250)","v":17.336796110444226},{"$f":"(LN('Other Graphs'!$A$6/'Other Graphs'!$A$9)+(D250+0.5*'Other Graphs'!$A$15^2)*'Other Graphs'!$A$12)/('Other Graphs'!$A$15*SQRT('Other Graphs'!$A$12))","v":0.30310889132455354},{"$f":"F250-'Other Graphs'!$A$15*SQRT('Other Graphs'!$A$12)","v":-4.3301270189221919E-2},0.61909656079420272,0.48273068935457275,153.85152355757722,null,null,1.4999999999999999E-2,{"$f":"IF($C$4, 'Other Graphs'!$A$6*Q250-EXP(-1*'Other Graphs'!$A$12*'Other Graphs'!$A$3)*'Other Graphs'!$A$9*R250,-1*'Other Graphs'!$A$6*Q250+EXP(-1*'Other Graphs'!$A$12*'Other Graphs'!$A$3)*'Other Graphs'!$A$9*R250)","v":10.964318625355745},{"$f":"(LN('Other Graphs'!$A$6/'Other Graphs'!$A$9)+('Other Graphs'!$A$3+0.5*M250^2)*'Other Graphs'!$A$12)/(M250*SQRT('Other Graphs'!$A$12))","v":4.0544422653841483},{"$f":"O250-M250*SQRT('Other Graphs'!$A$12)","v":4.0284615032706155},0.99997487297004906,0.9999719284741746,0.24424515663952201]
[null,null,null,0.02,{"$f":"IF($C$4, 'Other Graphs'!$A$6*H251-EXP(-1*'Other Graphs'!$A$12*D251)*'Other Graphs'!$A$9*I251,-1*'Other Graphs'!$A$6*H251+EXP(-1*'Other Graphs'!$A$12*D251)*'Other Graphs'!$A$9*I251)","v":18.106053728232112},{"$f":"(LN('Other Graphs'!$A$6/'Other Graphs'!$A$9)+(D251+0.5*'Other Graphs'!$A$15^2)*'Other Graphs'!$A$12)/('Other Graphs'!$A$15*SQRT('Other Graphs'!$A$12))","v":0.34641016151377552},{"$f":"F251-'Other Graphs'!$A$15*SQRT('Other Graphs'!$A$12)","v":0},0.63548275523059805,0.5,156.88874911646448,null,null,0.02,{"$f":"IF($C$4, 'Other Graphs'!$A$6*Q251-EXP(-1*'Other Graphs'!$A$12*'Other Graphs'!$A$3)*'Other Graphs'!$A$9*R251,-1*'Other Graphs'!$A$6*Q251+EXP(-1*'Other Graphs'!$A$12*'Other Graphs'!$A$3)*'Other Graphs'!$A$9*R251)","v":10.965539851138942},{"$f":"(LN('Other Graphs'!$A$6/'Other Graphs'!$A$9)+('Other Graphs'!$A$3+0.5*M251^2)*'Other Graphs'!$A$12)/(M251*SQRT('Other Graphs'!$A$12))","v":3.0484094213212241},{"$f":"O251-M251*SQRT('Other Graphs'!$A$12)","v":3.0137684051698463},0.99884971872271011,0.99870987654577714,2.0329624517074758]
[null,null,null,2.5000000000000001E-2,{"$f":"IF($C$4, 'Other Graphs'!$A$6*H252-EXP(-1*'Other Graphs'!$A$12*D252)*'Other Graphs'!$A$9*I252,-1*'Other Graphs'!$A$6*H252+EXP(-1*'Other Graphs'!$A$12*D252)*'Other Graphs'!$A$9*I252)","v":18.890497473814435},{"$f":"(LN('Other Graphs'!$A$6/'Other Graphs'!$A$9)+(D252+0.5*'Other Graphs'!$A$15^2)*'Other Graphs'!$A$12)/('Other Graphs'!$A$15*SQRT('Other Graphs'!$A$12))","v":0.38971143170299744},{"$f":"F252-'Other Graphs'!$A$15*SQRT('Other Graphs'!$A$12)","v":4.3301270189221974E-2},0.65162502884545082,0.51726931064542736,159.79653172278742,null,null,2.5000000000000001E-2,{"$f":"IF($C$4, 'Other Graphs'!$A$6*Q252-EXP(-1*'Other Graphs'!$A$12*'Other Graphs'!$A$3)*'Other Graphs'!$A$9*R252,-1*'Other Graphs'!$A$6*Q252+EXP(-1*'Other Graphs'!$A$12*'Other Graphs'!$A$3)*'Other Graphs'!$A$9*R252)","v":10.97570466339748},{"$f":"(LN('Other Graphs'!$A$6/'Other Graphs'!$A$9)+('Other Graphs'!$A$3+0.5*M252^2)*'Other Graphs'!$A$12)/(M252*SQRT('Other Graphs'!$A$12))","v":2.4465217656910396},{"$f":"O252-M252*SQRT('Other Graphs'!$A$12)","v":2.4032204955018175},0.99278789560786285,0.99187430743194571,6.4279573644114398]
[null,null,null,3.0000000000000002E-2,{"$f":"IF($C$4, 'Other Graphs'!$A$6*H253-EXP(-1*'Other Graphs'!$A$12*D253)*'Other Graphs'!$A$9*I253,-1*'Other Graphs'!$A$6*H253+EXP(-1*'Other Graphs'!$A$12*D253)*'Other Graphs'!$A$9*I253)","v":19.689480132428372},{"$f":"(LN('Other Graphs'!$A$6/'Other Graphs'!$A$9)+(D253+0.5*'Other Graphs'!$A$15^2)*'Other Graphs'!$A$12)/('Other Graphs'!$A$15*SQRT('Other Graphs'!$A$12))","v":0.43301270189221941},{"$f":"F253-'Other Graphs'!$A$15*SQRT('Other Graphs'!$A$12)","v":8.6602540378443948E-2},0.66749722894898555,0.53450627672021644,162.56846584951458,null,null,3.0000000000000002E-2,{"$f":"IF($C$4, 'Other Graphs'!$A$6*Q253-EXP(-1*'Other Graphs'!$A$12*'Other Graphs'!$A$3)*'Other Graphs'!$A$9*R253,-1*'Other Graphs'!$A$6*Q253+EXP(-1*'Other Graphs'!$A$12*'Other Graphs'!$A$3)*'Other Graphs'!$A$9*R253)","v":11.007844450219537},{"$f":"(LN('Other Graphs'!$A$6/'Other Graphs'!$A$9)+('Other Graphs'!$A$3+0.5*M253^2)*'Other Graphs'!$A$12)/(M253*SQRT('Other Graphs'!$A$12))","v":2.0467067042772231},{"$f":"O253-M253*SQRT('Other Graphs'!$A$12)","v":1.9947451800501568},0.97965655469938606,0.97696466046363151,12.679280911754629]
[null,null,null,3.5000000000000003E-2,{"$f":"IF($C$4, 'Other Graphs'!$A$6*H254-EXP(-1*'Other Graphs'!$A$12*D254)*'Other Graphs'!$A$9*I254,-1*'Other Graphs'!$A$6*H254+EXP(-1*'Other Graphs'!$A$12*D254)*'Other Graphs'!$A$9*I254)","v":20.502322461675945},{"$f":"(LN('Other Graphs'!$A$6/'Other Graphs'!$A$9)+(D254+0.5*'Other Graphs'!$A$15^2)*'Other Graphs'!$A$12)/('Other Graphs'!$A$15*SQRT('Other Graphs'!$A$12))","v":0.47631397208144133},{"$f":"F254-'Other Graphs'!$A$15*SQRT('Other Graphs'!$A$12)","v":0.12990381056766587},0.68307464361323722,0.55167873527964117,165.19873201758352,null,null,3.5000000000000003E-2,{"$f":"IF($C$4, 'Other Graphs'!$A$6*Q254-EXP(-1*'Other Graphs'!$A$12*'Other Graphs'!$A$3)*'Other Graphs'!$A$9*R254,-1*'Other Graphs'!$A$6*Q254+EXP(-1*'Other Graphs'!$A$12*'Other Graphs'!$A$3)*'Other Graphs'!$A$9*R254)","v":11.07124085477831},{"$f":"(LN('Other Graphs'!$A$6/'Other Graphs'!$A$9)+('Other Graphs'!$A$3+0.5*M254^2)*'Other Graphs'!$A$12)/(M254*SQRT('Other Graphs'!$A$12))","v":1.7623616967013329},{"$f":"O254-M254*SQRT('Other Graphs'!$A$12)","v":1.7017399184364221},0.96099589704811761,0.95559793311231733,19.499983490086958]
[null,null,null,0.04,{"$f":"IF($C$4, 'Other Graphs'!$A$6*H255-EXP(-1*'Other Graphs'!$A$12*D255)*'Other Graphs'!$A$9*I255,-1*'Other Graphs'!$A$6*H255+EXP(-1*'Other Graphs'!$A$12*D255)*'Other Graphs'!$A$9*I255)","v":21.328316121763862},{"$f":"(LN('Other Graphs'!$A$6/'Other Graphs'!$A$9)+(D255+0.5*'Other Graphs'!$A$15^2)*'Other Graphs'!$A$12)/('Other Graphs'!$A$15*SQRT('Other Graphs'!$A$12))","v":0.51961524227066325},{"$f":"F255-'Other Graphs'!$A$15*SQRT('Other Graphs'!$A$12)","v":0.17320508075688779},0.69833411385406685,0.56875488493203918,167.68212260127208,null,null,0.04,{"$f":"IF($C$4, 'Other Graphs'!$A$6*Q255-EXP(-1*'Other Graphs'!$A$12*'Other Graphs'!$A$3)*'Other Graphs'!$A$9*R255,-1*'Other Graphs'!$A$6*Q255+EXP(-1*'Other Graphs'!$A$12*'Other Graphs'!$A$3)*'Other Graphs'!$A$9*R255)","v":11.168740772228745},{"$f":"(LN('Other Graphs'!$A$6/'Other Graphs'!$A$9)+('Other Graphs'!$A$3+0.5*M255^2)*'Other Graphs'!$A$12)/(M255*SQRT('Other Graphs'!$A$12))","v":1.5501854727741455},{"$f":"O255-M255*SQRT('Other Graphs'!$A$12)","v":1.4809034404713906},0.93945149720094778,0.93068384694631079,26.029685423799279]
[null,null,null,4.4999999999999998E-2,{"$f":"IF($C$4, 'Other Graphs'!$A$6*H256-EXP(-1*'Other Graphs'!$A$12*D256)*'Other Graphs'!$A$9*I256,-1*'Other Graphs'!$A$6*H256+EXP(-1*'Other Graphs'!$A$12*D256)*'Other Graphs'!$A$9*I256)","v":22.166726734770222},{"$f":"(LN('Other Graphs'!$A$6/'Other Graphs'!$A$9)+(D256+0.5*'Other Graphs'!$A$15^2)*'Other Graphs'!$A$12)/('Other Graphs'!$A$15*SQRT('Other Graphs'!$A$12))","v":0.56291651245988517},{"$f":"F256-'Other Graphs'!$A$15*SQRT('Other Graphs'!$A$12)","v":0.2165063509461097},0.71325413221032863,0.58570346239067672,170.01406268290404,null,null,4.4999999999999998E-2,{"$f":"IF($C$4, 'Other Graphs'!$A$6*Q256-EXP(-1*'Other Graphs'!$A$12*'Other Graphs'!$A$3)*'Other Graphs'!$A$9*R256,-1*'Other Graphs'!$A$6*Q256+EXP(-1*'Other Graphs'!$A$12*'Other Graphs'!$A$3)*'Other Graphs'!$A$9*R256)","v":11.298889199347741},{"$f":"(LN('Other Graphs'!$A$6/'Other Graphs'!$A$9)+('Other Graphs'!$A$3+0.5*M256^2)*'Other Graphs'!$A$12)/(M256*SQRT('Other Graphs'!$A$12))","v":1.3861217712794269},{"$f":"O256-M256*SQRT('Other Graphs'!$A$12)","v":1.3081794849388275},0.91714513825128074,0.90459378066503848,31.882728304972844]
[null,null,null,4.9999999999999996E-2,{"$f":"IF($C$4, 'Other Graphs'!$A$6*H257-EXP(-1*'Other Graphs'!$A$12*D257)*'Other Graphs'!$A$9*I257,-1*'Other Graphs'!$A$6*H257+EXP(-1*'Other Graphs'!$A$12*D257)*'Other Graphs'!$A$9*I257)","v":23.016797048184742},{"$f":"(LN('Other Graphs'!$A$6/'Other Graphs'!$A$9)+(D257+0.5*'Other Graphs'!$A$15^2)*'Other Graphs'!$A$12)/('Other Graphs'!$A$15*SQRT('Other Graphs'!$A$12))","v":0.60621778264910708},{"$f":"F257-'Other Graphs'!$A$15*SQRT('Other Graphs'!$A$12)","v":0.25980762113533162},0.72781492707169515,0.60249391401788088,172.19062584610762,null,null,4.9999999999999996E-2,{"$f":"IF($C$4, 'Other Graphs'!$A$6*Q257-EXP(-1*'Other Graphs'!$A$12*'Other Graphs'!$A$3)*'Other Graphs'!$A$9*R257,-1*'Other Graphs'!$A$6*Q257+EXP(-1*'Other Graphs'!$A$12*'Other Graphs'!$A$3)*'Other Graphs'!$A$9*R257)","v":11.458302840872605},{"$f":"(LN('Other Graphs'!$A$6/'Other Graphs'!$A$9)+('Other Graphs'!$A$3+0.5*M257^2)*'Other Graphs'!$A$12)/(M257*SQRT('Other Graphs'!$A$12))","v":1.2557368354874363},{"$f":"O257-M257*SQRT('Other Graphs'!$A$12)","v":1.1691342951089925},0.8953943003260737,0.87882523580577354,36.958854484643687]
[null,null,null,5.4999999999999993E-2,{"$f":"IF($C$4, 'Other Graphs'!$A$6*H258-EXP(-1*'Other Graphs'!$A$12*D258)*'Other Graphs'!$A$9*I258,-1*'Other Graphs'!$A$6*H258+EXP(-1*'Other Graphs'!$A$12*D258)*'Other Graphs'!$A$9*I258)","v":23.87775017741528},{"$f":"(LN('Other Graphs'!$A$6/'Other Graphs'!$A$9)+(D258+0.5*'Other Graphs'!$A$15^2)*'Other Graphs'!$A$12)/('Other Graphs'!$A$15*SQRT('Other Graphs'!$A$12))","v":0.64951905283832889},{"$f":"F258-'Other Graphs'!$A$15*SQRT('Other Graphs'!$A$12)","v":0.30310889132455343},0.74199853227820678,0.61909656079420272,174.20854485547332,null,null,5.4999999999999993E-2,{"$f":"IF($C$4, 'Other Graphs'!$A$6*Q258-EXP(-1*'Other Graphs'!$A$12*'Other Graphs'!$A$3)*'Other Graphs'!$A$9*R258,-1*'Other Graphs'!$A$6*Q258+EXP(-1*'Other Graphs'!$A$12*'Other Graphs'!$A$3)*'Other Graphs'!$A$9*R258)","v":11.643097113295823},{"$f":"(LN('Other Graphs'!$A$6/'Other Graphs'!$A$9)+('Other Graphs'!$A$3+0.5*M258^2)*'Other Graphs'!$A$12)/(M258*SQRT('Other Graphs'!$A$12))","v":1.1498455474792482},{"$f":"O258-M258*SQRT('Other Graphs'!$A$12)","v":1.0545827530629599},0.87489625416217165,0.85419190244802634,41.292403388337128]
[null,null,null,5.9999999999999991E-2,{"$f":"IF($C$4, 'Other Graphs'!$A$6*H259-EXP(-1*'Other Graphs'!$A$12*D259)*'Other Graphs'!$A$9*I259,-1*'Other Graphs'!$A$6*H259+EXP(-1*'Other Graphs'!$A$12*D259)*'Other Graphs'!$A$9*I259)","v":24.748792901692646},{"$f":"(LN('Other Graphs'!$A$6/'Other Graphs'!$A$9)+(D259+0.5*'Other Graphs'!$A$15^2)*'Other Graphs'!$A$12)/('Other Graphs'!$A$15*SQRT('Other Graphs'!$A$12))","v":0.69282032302755081},{"$f":"F259-'Other Graphs'!$A$15*SQRT('Other Graphs'!$A$12)","v":0.34641016151377535},0.75578884168870319,0.63548275523059794,176.0652172280289,null,null,5.9999999999999991E-2,{"$f":"IF($C$4, 'Other Graphs'!$A$6*Q259-EXP(-1*'Other Graphs'!$A$12*'Other Graphs'!$A$3)*'Other Graphs'!$A$9*R259,-1*'Other Graphs'!$A$6*Q259+EXP(-1*'Other Graphs'!$A$12*'Other Graphs'!$A$3)*'Other Graphs'!$A$9*R259)","v":11.849559130237509},{"$f":"(LN('Other Graphs'!$A$6/'Other Graphs'!$A$9)+('Other Graphs'!$A$3+0.5*M259^2)*'Other Graphs'!$A$12)/(M259*SQRT('Other Graphs'!$A$12))","v":1.0623244953089117},{"$f":"O259-M259*SQRT('Other Graphs'!$A$12)","v":0.95840144685477913},0.85595580107572833,0.83106981703221861,44.968581032765108]
[null,null,null,6.4999999999999988E-2,{"$f":"IF($C$4, 'Other Graphs'!$A$6*H260-EXP(-1*'Other Graphs'!$A$12*D260)*'Other Graphs'!$A$9*I260,-1*'Other Graphs'!$A$6*H260+EXP(-1*'Other Graphs'!$A$12*D260)*'Other Graphs'!$A$9*I260)","v":25.62911898783279},{"$f":"(LN('Other Graphs'!$A$6/'Other Graphs'!$A$9)+(D260+0.5*'Other Graphs'!$A$15^2)*'Other Graphs'!$A$12)/('Other Graphs'!$A$15*SQRT('Other Graphs'!$A$12))","v":0.73612159321677284},{"$f":"F260-'Other Graphs'!$A$15*SQRT('Other Graphs'!$A$12)","v":0.38971143170299738},0.76917164858926945,0.6516250288454507,177.75870575867981,null,null,6.4999999999999988E-2,{"$f":"IF($C$4, 'Other Graphs'!$A$6*Q260-EXP(-1*'Other Graphs'!$A$12*'Other Graphs'!$A$3)*'Other Graphs'!$A$9*R260,-1*'Other Graphs'!$A$6*Q260+EXP(-1*'Other Graphs'!$A$12*'Other Graphs'!$A$3)*'Other Graphs'!$A$9*R260)","v":12.074402035401334},{"$f":"(LN('Other Graphs'!$A$6/'Other Graphs'!$A$9)+('Other Graphs'!$A$3+0.5*M260^2)*'Other Graphs'!$A$12)/(M260*SQRT('Other Graphs'!$A$12))","v":0.98893439378307657},{"$f":"O260-M260*SQRT('Other Graphs'!$A$12)","v":0.87635109129109956},0.83865237924578873,0.80958040098816531,48.083566693196602]
[null,null,null,6.9999999999999993E-2,{"$f":"IF($C$4, 'Other Graphs'!$A$6*H261-EXP(-1*'Other Graphs'!$A$12*D261)*'Other Graphs'!$A$9*I261,-1*'Other Graphs'!$A$6*H261+EXP(-1*'Other Graphs'!$A$12*D261)*'Other Graphs'!$A$9*I261)","v":26.51791251662619},{"$f":"(LN('Other Graphs'!$A$6/'Other Graphs'!$A$9)+(D261+0.5*'Other Graphs'!$A$15^2)*'Other Graphs'!$A$12)/('Other Graphs'!$A$15*SQRT('Other Graphs'!$A$12))","v":0.77942286340599487},{"$f":"F261-'Other Graphs'!$A$15*SQRT('Other Graphs'!$A$12)","v":0.43301270189221941},0.78213466998413184,0.66749722894898555,179.28773411607023,null,null,6.9999999999999993E-2,{"$f":"IF($C$4, 'Other Graphs'!$A$6*Q261-EXP(-1*'Other Graphs'!$A$12*'Other Graphs'!$A$3)*'Other Graphs'!$A$9*R261,-1*'Other Graphs'!$A$6*Q261+EXP(-1*'Other Graphs'!$A$12*'Other Graphs'!$A$3)*'Other Graphs'!$A$9*R261)","v":12.314819868867318},{"$f":"(LN('Other Graphs'!$A$6/'Other Graphs'!$A$9)+('Other Graphs'!$A$3+0.5*M261^2)*'Other Graphs'!$A$12)/(M261*SQRT('Other Graphs'!$A$12))","v":0.92664718204934948},{"$f":"O261-M261*SQRT('Other Graphs'!$A$12)","v":0.80540362551952804},0.82294512540081977,0.7897065998598316,50.727704415677934]
[null,null,null,7.4999999999999997E-2,{"$f":"IF($C$4, 'Other Graphs'!$A$6*H262-EXP(-1*'Other Graphs'!$A$12*D262)*'Other Graphs'!$A$9*I262,-1*'Other Graphs'!$A$6*H262+EXP(-1*'Other Graphs'!$A$12*D262)*'Other Graphs'!$A$9*I262)","v":27.414351187206542},{"$f":"(LN('Other Graphs'!$A$6/'Other Graphs'!$A$9)+(D262+0.5*'Other Graphs'!$A$15^2)*'Other Graphs'!$A$12)/('Other Graphs'!$A$15*SQRT('Other Graphs'!$A$12))","v":0.82272413359521679},{"$f":"F262-'Other Graphs'!$A$15*SQRT('Other Graphs'!$A$12)","v":0.47631397208144133},0.79466755597760164,0.68307464361323722,180.65167767683886,null,null,7.4999999999999997E-2,{"$f":"IF($C$4, 'Other Graphs'!$A$6*Q262-EXP(-1*'Other Graphs'!$A$12*'Other Graphs'!$A$3)*'Other Graphs'!$A$9*R262,-1*'Other Graphs'!$A$6*Q262+EXP(-1*'Other Graphs'!$A$12*'Other Graphs'!$A$3)*'Other Graphs'!$A$9*R262)","v":12.568458390945707},{"$f":"(LN('Other Graphs'!$A$6/'Other Graphs'!$A$9)+('Other Graphs'!$A$3+0.5*M262^2)*'Other Graphs'!$A$12)/(M262*SQRT('Other Graphs'!$A$12))","v":0.87324228214930921},{"$f":"O262-M262*SQRT('Other Graphs'!$A$12)","v":0.74333847158164346},0.80873448354497934,0.77136160737360826,52.979710127152607]
[null,null,null,0.08,{"$f":"IF($C$4, 'Other Graphs'!$A$6*H263-EXP(-1*'Other Graphs'!$A$12*D263)*'Other Graphs'!$A$9*I263,-1*'Other Graphs'!$A$6*H263+EXP(-1*'Other Graphs'!$A$12*D263)*'Other Graphs'!$A$9*I263)","v":28.317609575590737},{"$f":"(LN('Other Graphs'!$A$6/'Other Graphs'!$A$9)+(D263+0.5*'Other Graphs'!$A$15^2)*'Other Graphs'!$A$12)/('Other Graphs'!$A$15*SQRT('Other Graphs'!$A$12))","v":0.86602540378443882},{"$f":"F263-'Other Graphs'!$A$15*SQRT('Other Graphs'!$A$12)","v":0.51961524227066336},0.80676188461438381,0.69833411385406685,181.85054981430665,null,null,0.08,{"$f":"IF($C$4, 'Other Graphs'!$A$6*Q263-EXP(-1*'Other Graphs'!$A$12*'Other Graphs'!$A$3)*'Other Graphs'!$A$9*R263,-1*'Other Graphs'!$A$6*Q263+EXP(-1*'Other Graphs'!$A$12*'Other Graphs'!$A$3)*'Other Graphs'!$A$9*R263)","v":12.833356941581471},{"$f":"(LN('Other Graphs'!$A$6/'Other Graphs'!$A$9)+('Other Graphs'!$A$3+0.5*M263^2)*'Other Graphs'!$A$12)/(M263*SQRT('Other Graphs'!$A$12))","v":0.827054260614139},{"$f":"O263-M263*SQRT('Other Graphs'!$A$12)","v":0.68849019600862882},0.79589684626359791,0.75442792897092548,54.905754245487465]
[null,null,null,8.5000000000000006E-2,{"$f":"IF($C$4, 'Other Graphs'!$A$6*H264-EXP(-1*'Other Graphs'!$A$12*D264)*'Other Graphs'!$A$9*I264,-1*'Other Graphs'!$A$6*H264+EXP(-1*'Other Graphs'!$A$12*D264)*'Other Graphs'!$A$9*I264)","v":29.226862324662271},{"$f":"(LN('Other Graphs'!$A$6/'Other Graphs'!$A$9)+(D264+0.5*'Other Graphs'!$A$15^2)*'Other Graphs'!$A$12)/('Other Graphs'!$A$15*SQRT('Other Graphs'!$A$12))","v":0.90932667397366074},{"$f":"F264-'Other Graphs'!$A$15*SQRT('Other Graphs'!$A$12)","v":0.56291651245988528},0.81841114269471849,0.71325413221032874,182.88498390135129,null,null,8.5000000000000006E-2,{"$f":"IF($C$4, 'Other Graphs'!$A$6*Q264-EXP(-1*'Other Graphs'!$A$12*'Other Graphs'!$A$3)*'Other Graphs'!$A$9*R264,-1*'Other Graphs'!$A$6*Q264+EXP(-1*'Other Graphs'!$A$12*'Other Graphs'!$A$3)*'Other Graphs'!$A$9*R264)","v":13.107885712808908},{"$f":"(LN('Other Graphs'!$A$6/'Other Graphs'!$A$9)+('Other Graphs'!$A$3+0.5*M264^2)*'Other Graphs'!$A$12)/(M264*SQRT('Other Graphs'!$A$12))","v":0.78680955067356795},{"$f":"O264-M264*SQRT('Other Graphs'!$A$12)","v":0.63958523203021334},0.78430331911388351,0.73877885699928858,56.560490636670075]
[null,null,null,9.0000000000000011E-2,{"$f":"IF($C$4, 'Other Graphs'!$A$6*H265-EXP(-1*'Other Graphs'!$A$12*D265)*'Other Graphs'!$A$9*I265,-1*'Other Graphs'!$A$6*H265+EXP(-1*'Other Graphs'!$A$12*D265)*'Other Graphs'!$A$9*I265)","v":30.141287244169028},{"$f":"(LN('Other Graphs'!$A$6/'Other Graphs'!$A$9)+(D265+0.5*'Other Graphs'!$A$15^2)*'Other Graphs'!$A$12)/('Other Graphs'!$A$15*SQRT('Other Graphs'!$A$12))","v":0.95262794416288266},{"$f":"F265-'Other Graphs'!$A$15*SQRT('Other Graphs'!$A$12)","v":0.6062177826491072},0.82961069321852277,0.72781492707169515,183.75621132629885,null,null,9.0000000000000011E-2,{"$f":"IF($C$4, 'Other Graphs'!$A$6*Q265-EXP(-1*'Other Graphs'!$A$12*'Other Graphs'!$A$3)*'Other Graphs'!$A$9*R265,-1*'Other Graphs'!$A$6*Q265+EXP(-1*'Other Graphs'!$A$12*'Other Graphs'!$A$3)*'Other Graphs'!$A$9*R265)","v":13.390688165992259},{"$f":"(LN('Other Graphs'!$A$6/'Other Graphs'!$A$9)+('Other Graphs'!$A$3+0.5*M265^2)*'Other Graphs'!$A$12)/(M265*SQRT('Other Graphs'!$A$12))","v":0.75151760039516291},{"$f":"O265-M265*SQRT('Other Graphs'!$A$12)","v":0.59563302771396398},0.77382939375019744,0.72428979618953826,57.988699781108672]
[null,null,null,9.5000000000000015E-2,{"$f":"IF($C$4, 'Other Graphs'!$A$6*H266-EXP(-1*'Other Graphs'!$A$12*D266)*'Other Graphs'!$A$9*I266,-1*'Other Graphs'!$A$6*H266+EXP(-1*'Other Graphs'!$A$12*D266)*'Other Graphs'!$A$9*I266)","v":31.060068300800523},{"$f":"(LN('Other Graphs'!$A$6/'Other Graphs'!$A$9)+(D266+0.5*'Other Graphs'!$A$15^2)*'Other Graphs'!$A$12)/('Other Graphs'!$A$15*SQRT('Other Graphs'!$A$12))","v":0.99592921435210469},{"$f":"F266-'Other Graphs'!$A$15*SQRT('Other Graphs'!$A$12)","v":0.64951905283832922},0.840357730237277,0.741998532278207,184.46603585495023,null,null,9.5000000000000015E-2,{"$f":"IF($C$4, 'Other Graphs'!$A$6*Q266-EXP(-1*'Other Graphs'!$A$12*'Other Graphs'!$A$3)*'Other Graphs'!$A$9*R266,-1*'Other Graphs'!$A$6*Q266+EXP(-1*'Other Graphs'!$A$12*'Other Graphs'!$A$3)*'Other Graphs'!$A$9*R266)","v":13.680631664897803},{"$f":"(LN('Other Graphs'!$A$6/'Other Graphs'!$A$9)+('Other Graphs'!$A$3+0.5*M266^2)*'Other Graphs'!$A$12)/(M266*SQRT('Other Graphs'!$A$12))","v":0.72039639509542386},{"$f":"O266-M266*SQRT('Other Graphs'!$A$12)","v":0.5558515683763805},0.76435951553492276,0.71084383542580132,59.226975621871198]
[null,null,null,0.10000000000000002,{"$f":"IF($C$4, 'Other Graphs'!$A$6*H267-EXP(-1*'Other Graphs'!$A$12*D267)*'Other Graphs'!$A$9*I267,-1*'Other Graphs'!$A$6*H267+EXP(-1*'Other Graphs'!$A$12*D267)*'Other Graphs'!$A$9*I267)","v":31.982398480075275},{"$f":"(LN('Other Graphs'!$A$6/'Other Graphs'!$A$9)+(D267+0.5*'Other Graphs'!$A$15^2)*'Other Graphs'!$A$12)/('Other Graphs'!$A$15*SQRT('Other Graphs'!$A$12))","v":1.0392304845413267},{"$f":"F267-'Other Graphs'!$A$15*SQRT('Other Graphs'!$A$12)","v":0.69282032302755125},0.85065122200251508,0.75578884168870331,185.01680469991851,null,null,0.10000000000000002,{"$f":"IF($C$4, 'Other Graphs'!$A$6*Q267-EXP(-1*'Other Graphs'!$A$12*'Other Graphs'!$A$3)*'Other Graphs'!$A$9*R267,-1*'Other Graphs'!$A$6*Q267+EXP(-1*'Other Graphs'!$A$12*'Other Graphs'!$A$3)*'Other Graphs'!$A$9*R267)","v":13.976766543007159},{"$f":"(LN('Other Graphs'!$A$6/'Other Graphs'!$A$9)+('Other Graphs'!$A$3+0.5*M267^2)*'Other Graphs'!$A$12)/(M267*SQRT('Other Graphs'!$A$12))","v":0.69282032302755092},{"$f":"O267-M267*SQRT('Other Graphs'!$A$12)","v":0.51961524227066314},0.75578884168870331,0.69833411385406674,60.305237839997915]
[null,null,null,0.10500000000000002,{"$f":"IF($C$4, 'Other Graphs'!$A$6*H268-EXP(-1*'Other Graphs'!$A$12*D268)*'Other Graphs'!$A$9*I268,-1*'Other Graphs'!$A$6*H268+EXP(-1*'Other Graphs'!$A$12*D268)*'Other Graphs'!$A$9*I268)","v":32.907482503574869},{"$f":"(LN('Other Graphs'!$A$6/'Other Graphs'!$A$9)+(D268+0.5*'Other Graphs'!$A$15^2)*'Other Graphs'!$A$12)/('Other Graphs'!$A$15*SQRT('Other Graphs'!$A$12))","v":1.0825317547305486},{"$f":"F268-'Other Graphs'!$A$15*SQRT('Other Graphs'!$A$12)","v":0.73612159321677317},0.86049184339431817,0.76917164858926956,185.41137668208006,null,null,0.10500000000000002,{"$f":"IF($C$4, 'Other Graphs'!$A$6*Q268-EXP(-1*'Other Graphs'!$A$12*'Other Graphs'!$A$3)*'Other Graphs'!$A$9*R268,-1*'Other Graphs'!$A$6*Q268+EXP(-1*'Other Graphs'!$A$12*'Other Graphs'!$A$3)*'Other Graphs'!$A$9*R268)","v":14.278292732207149},{"$f":"(LN('Other Graphs'!$A$6/'Other Graphs'!$A$9)+('Other Graphs'!$A$3+0.5*M268^2)*'Other Graphs'!$A$12)/(M268*SQRT('Other Graphs'!$A$12))","v":0.66828293658699178},{"$f":"O268-M268*SQRT('Other Graphs'!$A$12)","v":0.48641760179225962},0.74802349836307336,0.68666444337792054,61.248008363980887]
[null,null,null,0.11000000000000003,{"$f":"IF($C$4, 'Other Graphs'!$A$6*H269-EXP(-1*'Other Graphs'!$A$12*D269)*'Other Graphs'!$A$9*I269,-1*'Other Graphs'!$A$6*H269+EXP(-1*'Other Graphs'!$A$12*D269)*'Other Graphs'!$A$9*I269)","v":33.83453938698527},{"$f":"(LN('Other Graphs'!$A$6/'Other Graphs'!$A$9)+(D269+0.5*'Other Graphs'!$A$15^2)*'Other Graphs'!$A$12)/('Other Graphs'!$A$15*SQRT('Other Graphs'!$A$12))","v":1.1258330249197706},{"$f":"F269-'Other Graphs'!$A$15*SQRT('Other Graphs'!$A$12)","v":0.77942286340599509},0.86988189869140564,0.78213466998413184,185.65308788527074,null,null,0.11000000000000003,{"$f":"IF($C$4, 'Other Graphs'!$A$6*Q269-EXP(-1*'Other Graphs'!$A$12*'Other Graphs'!$A$3)*'Other Graphs'!$A$9*R269,-1*'Other Graphs'!$A$6*Q269+EXP(-1*'Other Graphs'!$A$12*'Other Graphs'!$A$3)*'Other Graphs'!$A$9*R269)","v":14.584532774027053},{"$f":"(LN('Other Graphs'!$A$6/'Other Graphs'!$A$9)+('Other Graphs'!$A$3+0.5*M269^2)*'Other Graphs'!$A$12)/(M269*SQRT('Other Graphs'!$A$12))","v":0.64636986955184006},{"$f":"O269-M269*SQRT('Other Graphs'!$A$12)","v":0.45584428071926353},0.74098007566226132,0.67574902028940709,62.075456651882575]
[null,null,null,0.11500000000000003,{"$f":"IF($C$4, 'Other Graphs'!$A$6*H270-EXP(-1*'Other Graphs'!$A$12*D270)*'Other Graphs'!$A$9*I270,-1*'Other Graphs'!$A$6*H270+EXP(-1*'Other Graphs'!$A$12*D270)*'Other Graphs'!$A$9*I270)","v":34.762804826411625},{"$f":"(LN('Other Graphs'!$A$6/'Other Graphs'!$A$9)+(D270+0.5*'Other Graphs'!$A$15^2)*'Other Graphs'!$A$12)/('Other Graphs'!$A$15*SQRT('Other Graphs'!$A$12))","v":1.1691342951089925},{"$f":"F270-'Other Graphs'!$A$15*SQRT('Other Graphs'!$A$12)","v":0.82272413359521701},0.87882523580577354,0.79466755597760164,185.74571521744599,null,null,0.11500000000000003,{"$f":"IF($C$4, 'Other Graphs'!$A$6*Q270-EXP(-1*'Other Graphs'!$A$12*'Other Graphs'!$A$3)*'Other Graphs'!$A$9*R270,-1*'Other Graphs'!$A$6*Q270+EXP(-1*'Other Graphs'!$A$12*'Other Graphs'!$A$3)*'Other Graphs'!$A$9*R270)","v":14.894910057286467},{"$f":"(LN('Other Graphs'!$A$6/'Other Graphs'!$A$9)+('Other Graphs'!$A$3+0.5*M270^2)*'Other Graphs'!$A$12)/(M270*SQRT('Other Graphs'!$A$12))","v":0.62673881939095577},{"$f":"O270-M270*SQRT('Other Graphs'!$A$12)","v":0.42755297652053481},0.73458477337164418,0.66551169616306283,62.804242244825957]
[null,null,null,0.12000000000000004,{"$f":"IF($C$4, 'Other Graphs'!$A$6*H271-EXP(-1*'Other Graphs'!$A$12*D271)*'Other Graphs'!$A$9*I271,-1*'Other Graphs'!$A$6*H271+EXP(-1*'Other Graphs'!$A$12*D271)*'Other Graphs'!$A$9*I271)","v":35.691533402498855},{"$f":"(LN('Other Graphs'!$A$6/'Other Graphs'!$A$9)+(D271+0.5*'Other Graphs'!$A$15^2)*'Other Graphs'!$A$12)/('Other Graphs'!$A$15*SQRT('Other Graphs'!$A$12))","v":1.2124355652982146},{"$f":"F271-'Other Graphs'!$A$15*SQRT('Other Graphs'!$A$12)","v":0.86602540378443915},0.88732715314916666,0.80676188461438381,185.69343829658072,null,null,0.12000000000000004,{"$f":"IF($C$4, 'Other Graphs'!$A$6*Q271-EXP(-1*'Other Graphs'!$A$12*'Other Graphs'!$A$3)*'Other Graphs'!$A$9*R271,-1*'Other Graphs'!$A$6*Q271+EXP(-1*'Other Graphs'!$A$12*'Other Graphs'!$A$3)*'Other Graphs'!$A$9*R271)","v":15.208931268510597},{"$f":"(LN('Other Graphs'!$A$6/'Other Graphs'!$A$9)+('Other Graphs'!$A$3+0.5*M271^2)*'Other Graphs'!$A$12)/(M271*SQRT('Other Graphs'!$A$12))","v":0.60910453399505515},{"$f":"O271-M271*SQRT('Other Graphs'!$A$12)","v":0.40125843708678982},0.72877242375123097,0.65588506966690574,63.448188654271696]
[null,null,null,0.12500000000000003,{"$f":"IF($C$4, 'Other Graphs'!$A$6*H272-EXP(-1*'Other Graphs'!$A$12*D272)*'Other Graphs'!$A$9*I272,-1*'Other Graphs'!$A$6*H272+EXP(-1*'Other Graphs'!$A$12*D272)*'Other Graphs'!$A$9*I272)","v":36.620000593981757},{"$f":"(LN('Other Graphs'!$A$6/'Other Graphs'!$A$9)+(D272+0.5*'Other Graphs'!$A$15^2)*'Other Graphs'!$A$12)/('Other Graphs'!$A$15*SQRT('Other Graphs'!$A$12))","v":1.2557368354874361},{"$f":"F272-'Other Graphs'!$A$15*SQRT('Other Graphs'!$A$12)","v":0.90932667397366063},0.89539430032607359,0.81841114269471849,185.50080007978079,null,null,0.12500000000000003,{"$f":"IF($C$4, 'Other Graphs'!$A$6*Q272-EXP(-1*'Other Graphs'!$A$12*'Other Graphs'!$A$3)*'Other Graphs'!$A$9*R272,-1*'Other Graphs'!$A$6*Q272+EXP(-1*'Other Graphs'!$A$12*'Other Graphs'!$A$3)*'Other Graphs'!$A$9*R272)","v":15.526172211781955},{"$f":"(LN('Other Graphs'!$A$6/'Other Graphs'!$A$9)+('Other Graphs'!$A$3+0.5*M272^2)*'Other Graphs'!$A$12)/(M272*SQRT('Other Graphs'!$A$12))","v":0.59322740159234044},{"$f":"O272-M272*SQRT('Other Graphs'!$A$12)","v":0.37672105064623074},0.7234855116100718,0.64680954133087687,64.018820693264843]
[null,null,null,0.13000000000000003,{"$f":"IF($C$4, 'Other Graphs'!$A$6*H273-EXP(-1*'Other Graphs'!$A$12*D273)*'Other Graphs'!$A$9*I273,-1*'Other Graphs'!$A$6*H273+EXP(-1*'Other Graphs'!$A$12*D273)*'Other Graphs'!$A$9*I273)","v":37.547504594380662},{"$f":"(LN('Other Graphs'!$A$6/'Other Graphs'!$A$9)+(D273+0.5*'Other Graphs'!$A$15^2)*'Other Graphs'!$A$12)/('Other Graphs'!$A$15*SQRT('Other Graphs'!$A$12))","v":1.2990381056766582},{"$f":"F273-'Other Graphs'!$A$15*SQRT('Other Graphs'!$A$12)","v":0.95262794416288277},0.90303457385879471,0.82961069321852277,185.17266664882879,null,null,0.13000000000000003,{"$f":"IF($C$4, 'Other Graphs'!$A$6*Q273-EXP(-1*'Other Graphs'!$A$12*'Other Graphs'!$A$3)*'Other Graphs'!$A$9*R273,-1*'Other Graphs'!$A$6*Q273+EXP(-1*'Other Graphs'!$A$12*'Other Graphs'!$A$3)*'Other Graphs'!$A$9*R273)","v":15.846266315248279},{"$f":"(LN('Other Graphs'!$A$6/'Other Graphs'!$A$9)+('Other Graphs'!$A$3+0.5*M273^2)*'Other Graphs'!$A$12)/(M273*SQRT('Other Graphs'!$A$12))","v":0.5789046737605209},{"$f":"O273-M273*SQRT('Other Graphs'!$A$12)","v":0.35373806877656683},0.71867325179742281,0.63823240496052147,64.52579284100176]
[null,null,null,0.13500000000000004,{"$f":"IF($C$4, 'Other Graphs'!$A$6*H274-EXP(-1*'Other Graphs'!$A$12*D274)*'Other Graphs'!$A$9*I274,-1*'Other Graphs'!$A$6*H274+EXP(-1*'Other Graphs'!$A$12*D274)*'Other Graphs'!$A$9*I274)","v":38.473367927624807},{"$f":"(LN('Other Graphs'!$A$6/'Other Graphs'!$A$9)+(D274+0.5*'Other Graphs'!$A$15^2)*'Other Graphs'!$A$12)/('Other Graphs'!$A$15*SQRT('Other Graphs'!$A$12))","v":1.3423393758658801},{"$f":"F274-'Other Graphs'!$A$15*SQRT('Other Graphs'!$A$12)","v":0.99592921435210469},0.91025700914505969,0.840357730237277,184.71418655505528,null,null,0.13500000000000004,{"$f":"IF($C$4, 'Other Graphs'!$A$6*Q274-EXP(-1*'Other Graphs'!$A$12*'Other Graphs'!$A$3)*'Other Graphs'!$A$9*R274,-1*'Other Graphs'!$A$6*Q274+EXP(-1*'Other Graphs'!$A$12*'Other Graphs'!$A$3)*'Other Graphs'!$A$9*R274)","v":16.168895279453288},{"$f":"(LN('Other Graphs'!$A$6/'Other Graphs'!$A$9)+('Other Graphs'!$A$3+0.5*M274^2)*'Other Graphs'!$A$12)/(M274*SQRT('Other Graphs'!$A$12))","v":0.56596363888060819},{"$f":"O274-M274*SQRT('Other Graphs'!$A$12)","v":0.33213677985880974},0.71429075062699932,0.63010701064926711,64.977231292320369]
[null,null,null,0.14000000000000004,{"$f":"IF($C$4, 'Other Graphs'!$A$6*H275-EXP(-1*'Other Graphs'!$A$12*D275)*'Other Graphs'!$A$9*I275,-1*'Other Graphs'!$A$6*H275+EXP(-1*'Other Graphs'!$A$12*D275)*'Other Graphs'!$A$9*I275)","v":39.396938860400084},{"$f":"(LN('Other Graphs'!$A$6/'Other Graphs'!$A$9)+(D275+0.5*'Other Graphs'!$A$15^2)*'Other Graphs'!$A$12)/('Other Graphs'!$A$15*SQRT('Other Graphs'!$A$12))","v":1.3856406460551021},{"$f":"F275-'Other Graphs'!$A$15*SQRT('Other Graphs'!$A$12)","v":1.0392304845413265},0.91707166982854504,0.85065122200251497,184.13075011132474,null,null,0.14000000000000004,{"$f":"IF($C$4, 'Other Graphs'!$A$6*Q275-EXP(-1*'Other Graphs'!$A$12*'Other Graphs'!$A$3)*'Other Graphs'!$A$9*R275,-1*'Other Graphs'!$A$6*Q275+EXP(-1*'Other Graphs'!$A$12*'Other Graphs'!$A$3)*'Other Graphs'!$A$9*R275)","v":16.49378143591489},{"$f":"(LN('Other Graphs'!$A$6/'Other Graphs'!$A$9)+('Other Graphs'!$A$3+0.5*M275^2)*'Other Graphs'!$A$12)/(M275*SQRT('Other Graphs'!$A$12))","v":0.55425625842204074},{"$f":"O275-M275*SQRT('Other Graphs'!$A$12)","v":0.31176914536239786},0.71029825932878665,0.62239201273768407,65.380007843776809]
[null,null,null,0.14500000000000005,{"$f":"IF($C$4, 'Other Graphs'!$A$6*H276-EXP(-1*'Other Graphs'!$A$12*D276)*'Other Graphs'!$A$9*I276,-1*'Other Graphs'!$A$6*H276+EXP(-1*'Other Graphs'!$A$12*D276)*'Other Graphs'!$A$9*I276)","v":40.317592610956709},{"$f":"(LN('Other Graphs'!$A$6/'Other Graphs'!$A$9)+(D276+0.5*'Other Graphs'!$A$15^2)*'Other Graphs'!$A$12)/('Other Graphs'!$A$15*SQRT('Other Graphs'!$A$12))","v":1.428941916244324},{"$f":"F276-'Other Graphs'!$A$15*SQRT('Other Graphs'!$A$12)","v":1.0825317547305486},0.92348953572850312,0.86049184339431817,183.42794900010358,null,null,0.14500000000000005,{"$f":"IF($C$4, 'Other Graphs'!$A$6*Q276-EXP(-1*'Other Graphs'!$A$12*'Other Graphs'!$A$3)*'Other Graphs'!$A$9*R276,-1*'Other Graphs'!$A$6*Q276+EXP(-1*'Other Graphs'!$A$12*'Other Graphs'!$A$3)*'Other Graphs'!$A$9*R276)","v":16.820681475133775},{"$f":"(LN('Other Graphs'!$A$6/'Other Graphs'!$A$9)+('Other Graphs'!$A$3+0.5*M276^2)*'Other Graphs'!$A$12)/(M276*SQRT('Other Graphs'!$A$12))","v":0.54365491296192092},{"$f":"O276-M276*SQRT('Other Graphs'!$A$12)","v":0.29250754586443367},0.70666051790584294,0.61505070435888898,65.739959970119287]
[null,null,null,0.15000000000000005,{"$f":"IF($C$4, 'Other Graphs'!$A$6*H277-EXP(-1*'Other Graphs'!$A$12*D277)*'Other Graphs'!$A$9*I277,-1*'Other Graphs'!$A$6*H277+EXP(-1*'Other Graphs'!$A$12*D277)*'Other Graphs'!$A$9*I277)","v":41.234732355957227},{"$f":"(LN('Other Graphs'!$A$6/'Other Graphs'!$A$9)+(D277+0.5*'Other Graphs'!$A$15^2)*'Other Graphs'!$A$12)/('Other Graphs'!$A$15*SQRT('Other Graphs'!$A$12))","v":1.4722431864335461},{"$f":"F277-'Other Graphs'!$A$15*SQRT('Other Graphs'!$A$12)","v":1.1258330249197708},0.92952239042781437,0.86988189869140564,182.6115365436662,null,null,0.15000000000000005,{"$f":"IF($C$4, 'Other Graphs'!$A$6*Q277-EXP(-1*'Other Graphs'!$A$12*'Other Graphs'!$A$3)*'Other Graphs'!$A$9*R277,-1*'Other Graphs'!$A$6*Q277+EXP(-1*'Other Graphs'!$A$12*'Other Graphs'!$A$3)*'Other Graphs'!$A$9*R277)","v":17.149381274984371},{"$f":"(LN('Other Graphs'!$A$6/'Other Graphs'!$A$9)+('Other Graphs'!$A$3+0.5*M277^2)*'Other Graphs'!$A$12)/(M277*SQRT('Other Graphs'!$A$12))","v":0.53404899900040381},{"$f":"O277-M277*SQRT('Other Graphs'!$A$12)","v":0.27424137786507213},0.7033461830070723,0.60805043419040816,66.06206836453191]
[null,null,null,0.15500000000000005,{"$f":"IF($C$4, 'Other Graphs'!$A$6*H278-EXP(-1*'Other Graphs'!$A$12*D278)*'Other Graphs'!$A$9*I278,-1*'Other Graphs'!$A$6*H278+EXP(-1*'Other Graphs'!$A$12*D278)*'Other Graphs'!$A$9*I278)","v":42.147790038675559},{"$f":"(LN('Other Graphs'!$A$6/'Other Graphs'!$A$9)+(D278+0.5*'Other Graphs'!$A$15^2)*'Other Graphs'!$A$12)/('Other Graphs'!$A$15*SQRT('Other Graphs'!$A$12))","v":1.515544456622768},{"$f":"F278-'Other Graphs'!$A$15*SQRT('Other Graphs'!$A$12)","v":1.1691342951089925},0.93518270956049354,0.87882523580577354,181.68738895658106,null,null,0.15500000000000005,{"$f":"IF($C$4, 'Other Graphs'!$A$6*Q278-EXP(-1*'Other Graphs'!$A$12*'Other Graphs'!$A$3)*'Other Graphs'!$A$9*R278,-1*'Other Graphs'!$A$6*Q278+EXP(-1*'Other Graphs'!$A$12*'Other Graphs'!$A$3)*'Other Graphs'!$A$9*R278)","v":17.479691616807031},{"$f":"(LN('Other Graphs'!$A$6/'Other Graphs'!$A$9)+('Other Graphs'!$A$3+0.5*M278^2)*'Other Graphs'!$A$12)/(M278*SQRT('Other Graphs'!$A$12))","v":0.52534218445697967},{"$f":"O278-M278*SQRT('Other Graphs'!$A$12)","v":0.25687430928380361},0.70032733143678905,0.60136209825318154,66.350600770569145]
[null,null,null,0.16000000000000006,{"$f":"IF($C$4, 'Other Graphs'!$A$6*H279-EXP(-1*'Other Graphs'!$A$12*D279)*'Other Graphs'!$A$9*I279,-1*'Other Graphs'!$A$6*H279+EXP(-1*'Other Graphs'!$A$12*D279)*'Other Graphs'!$A$9*I279)","v":43.056226983458465},{"$f":"(LN('Other Graphs'!$A$6/'Other Graphs'!$A$9)+(D279+0.5*'Other Graphs'!$A$15^2)*'Other Graphs'!$A$12)/('Other Graphs'!$A$15*SQRT('Other Graphs'!$A$12))","v":1.55884572681199},{"$f":"F279-'Other Graphs'!$A$15*SQRT('Other Graphs'!$A$12)","v":1.2124355652982146},0.94048355077149615,0.88732715314916666,180.66146787218412,null,null,0.16000000000000006,{"$f":"IF($C$4, 'Other Graphs'!$A$6*Q279-EXP(-1*'Other Graphs'!$A$12*'Other Graphs'!$A$3)*'Other Graphs'!$A$9*R279,-1*'Other Graphs'!$A$6*Q279+EXP(-1*'Other Graphs'!$A$12*'Other Graphs'!$A$3)*'Other Graphs'!$A$9*R279)","v":17.811444620659877},{"$f":"(LN('Other Graphs'!$A$6/'Other Graphs'!$A$9)+('Other Graphs'!$A$3+0.5*M279^2)*'Other Graphs'!$A$12)/(M279*SQRT('Other Graphs'!$A$12))","v":0.51745017876120203},{"$f":"O279-M279*SQRT('Other Graphs'!$A$12)","v":0.24032204955018155},0.69757903044956182,0.59495969862806497,66.609229015200754]
[null,null,null,0.16500000000000006,{"$f":"IF($C$4, 'Other Graphs'!$A$6*H280-EXP(-1*'Other Graphs'!$A$12*D280)*'Other Graphs'!$A$9*I280,-1*'Other Graphs'!$A$6*H280+EXP(-1*'Other Graphs'!$A$12*D280)*'Other Graphs'!$A$9*I280)","v":43.959534322819387},{"$f":"(LN('Other Graphs'!$A$6/'Other Graphs'!$A$9)+(D280+0.5*'Other Graphs'!$A$15^2)*'Other Graphs'!$A$12)/('Other Graphs'!$A$15*SQRT('Other Graphs'!$A$12))","v":1.6021469970012119},{"$f":"F280-'Other Graphs'!$A$15*SQRT('Other Graphs'!$A$12)","v":1.2557368354874363},0.9454384462451576,0.8953943003260737,179.53978440407622,null,null,0.16500000000000006,{"$f":"IF($C$4, 'Other Graphs'!$A$6*Q280-EXP(-1*'Other Graphs'!$A$12*'Other Graphs'!$A$3)*'Other Graphs'!$A$9*R280,-1*'Other Graphs'!$A$6*Q280+EXP(-1*'Other Graphs'!$A$12*'Other Graphs'!$A$3)*'Other Graphs'!$A$9*R280)","v":18.144490765735881},{"$f":"(LN('Other Graphs'!$A$6/'Other Graphs'!$A$9)+('Other Graphs'!$A$3+0.5*M280^2)*'Other Graphs'!$A$12)/(M280*SQRT('Other Graphs'!$A$12))","v":0.51029890838146696},{"$f":"O280-M280*SQRT('Other Graphs'!$A$12)","v":0.22451052513260211},0.69507896629899735,0.58881996096697242,66.841124657540206]
[null,null,null,0.17000000000000007,{"$f":"IF($C$4, 'Other Graphs'!$A$6*H281-EXP(-1*'Other Graphs'!$A$12*D281)*'Other Graphs'!$A$9*I281,-1*'Other Graphs'!$A$6*H281+EXP(-1*'Other Graphs'!$A$12*D281)*'Other Graphs'!$A$9*I281)","v":44.857233244839769},{"$f":"(LN('Other Graphs'!$A$6/'Other Graphs'!$A$9)+(D281+0.5*'Other Graphs'!$A$15^2)*'Other Graphs'!$A$12)/('Other Graphs'!$A$15*SQRT('Other Graphs'!$A$12))","v":1.645448267190434},{"$f":"F281-'Other Graphs'!$A$15*SQRT('Other Graphs'!$A$12)","v":1.2990381056766584},0.95006129861536803,0.90303457385879482,178.32836497183547,null,null,0.17000000000000007,{"$f":"IF($C$4, 'Other Graphs'!$A$6*Q281-EXP(-1*'Other Graphs'!$A$12*'Other Graphs'!$A$3)*'Other Graphs'!$A$9*R281,-1*'Other Graphs'!$A$6*Q281+EXP(-1*'Other Graphs'!$A$12*'Other Graphs'!$A$3)*'Other Graphs'!$A$9*R281)","v":18.478696389023582},{"$f":"(LN('Other Graphs'!$A$6/'Other Graphs'!$A$9)+('Other Graphs'!$A$3+0.5*M281^2)*'Other Graphs'!$A$12)/(M281*SQRT('Other Graphs'!$A$12))","v":0.50382301431929988},{"$f":"O281-M281*SQRT('Other Graphs'!$A$12)","v":0.20937437703259065},0.69280712320763527,0.58292200317827692,67.049037505860497]
[null,null,null,0.17500000000000007,{"$f":"IF($C$4, 'Other Graphs'!$A$6*H282-EXP(-1*'Other Graphs'!$A$12*D282)*'Other Graphs'!$A$9*I282,-1*'Other Graphs'!$A$6*H282+EXP(-1*'Other Graphs'!$A$12*D282)*'Other Graphs'!$A$9*I282)","v":45.748875069698947},{"$f":"(LN('Other Graphs'!$A$6/'Other Graphs'!$A$9)+(D282+0.5*'Other Graphs'!$A$15^2)*'Other Graphs'!$A$12)/('Other Graphs'!$A$15*SQRT('Other Graphs'!$A$12))","v":1.6887495373796559},{"$f":"F282-'Other Graphs'!$A$15*SQRT('Other Graphs'!$A$12)","v":1.3423393758658806},0.9543662809822433,0.91025700914505969,177.03321908697359,null,null,0.17500000000000007,{"$f":"IF($C$4, 'Other Graphs'!$A$6*Q282-EXP(-1*'Other Graphs'!$A$12*'Other Graphs'!$A$3)*'Other Graphs'!$A$9*R282,-1*'Other Graphs'!$A$6*Q282+EXP(-1*'Other Graphs'!$A$12*'Other Graphs'!$A$3)*'Other Graphs'!$A$9*R282)","v":18.813941576552885},{"$f":"(LN('Other Graphs'!$A$6/'Other Graphs'!$A$9)+('Other Graphs'!$A$3+0.5*M282^2)*'Other Graphs'!$A$12)/(M282*SQRT('Other Graphs'!$A$12))","v":0.49796460717605218},{"$f":"O282-M282*SQRT('Other Graphs'!$A$12)","v":0.19485571585149852},0.69074550576962446,0.57724704838938867,67.235360352456951]
[null,null,null,0.18000000000000008,{"$f":"IF($C$4, 'Other Graphs'!$A$6*H283-EXP(-1*'Other Graphs'!$A$12*D283)*'Other Graphs'!$A$9*I283,-1*'Other Graphs'!$A$6*H283+EXP(-1*'Other Graphs'!$A$12*D283)*'Other Graphs'!$A$9*I283)","v":46.634041165133816},{"$f":"(LN('Other Graphs'!$A$6/'Other Graphs'!$A$9)+(D283+0.5*'Other Graphs'!$A$15^2)*'Other Graphs'!$A$12)/('Other Graphs'!$A$15*SQRT('Other Graphs'!$A$12))","v":1.7320508075688779},{"$f":"F283-'Other Graphs'!$A$15*SQRT('Other Graphs'!$A$12)","v":1.3856406460551023},0.9583677416682248,0.91707166982854516,175.66030926193847,null,null,0.18000000000000008,{"$f":"IF($C$4, 'Other Graphs'!$A$6*Q283-EXP(-1*'Other Graphs'!$A$12*'Other Graphs'!$A$3)*'Other Graphs'!$A$9*R283,-1*'Other Graphs'!$A$6*Q283+EXP(-1*'Other Graphs'!$A$12*'Other Graphs'!$A$3)*'Other Graphs'!$A$9*R283)","v":19.15011837831517},{"$f":"(LN('Other Graphs'!$A$6/'Other Graphs'!$A$9)+('Other Graphs'!$A$3+0.5*M283^2)*'Other Graphs'!$A$12)/(M283*SQRT('Other Graphs'!$A$12))","v":0.49267222970848062},{"$f":"O283-M283*SQRT('Other Graphs'!$A$12)","v":0.1809030843460826},0.68887789866189919,0.57177817608001869,67.40218257448015]
[null,null,null,0.18500000000000008,{"$f":"IF($C$4, 'Other Graphs'!$A$6*H284-EXP(-1*'Other Graphs'!$A$12*D284)*'Other Graphs'!$A$9*I284,-1*'Other Graphs'!$A$6*H284+EXP(-1*'Other Graphs'!$A$12*D284)*'Other Graphs'!$A$9*I284)","v":47.512342711443509},{"$f":"(LN('Other Graphs'!$A$6/'Other Graphs'!$A$9)+(D284+0.5*'Other Graphs'!$A$15^2)*'Other Graphs'!$A$12)/('Other Graphs'!$A$15*SQRT('Other Graphs'!$A$12))","v":1.7753520777580998},{"$f":"F284-'Other Graphs'!$A$15*SQRT('Other Graphs'!$A$12)","v":1.4289419162443244},0.96208011425275863,0.92348953572850323,174.21552317159964,null,null,0.18500000000000008,{"$f":"IF($C$4, 'Other Graphs'!$A$6*Q284-EXP(-1*'Other Graphs'!$A$12*'Other Graphs'!$A$3)*'Other Graphs'!$A$9*R284,-1*'Other Graphs'!$A$6*Q284+EXP(-1*'Other Graphs'!$A$12*'Other Graphs'!$A$3)*'Other Graphs'!$A$9*R284)","v":19.487129291187571},{"$f":"(LN('Other Graphs'!$A$6/'Other Graphs'!$A$9)+('Other Graphs'!$A$3+0.5*M284^2)*'Other Graphs'!$A$12)/(M284*SQRT('Other Graphs'!$A$12))","v":0.48789998761855746},{"$f":"O284-M284*SQRT('Other Graphs'!$A$12)","v":0.16747058821831506},0.68718965835815649,0.56650010605515755,67.551334701403164]
[null,null,null,0.19000000000000009,{"$f":"IF($C$4, 'Other Graphs'!$A$6*H285-EXP(-1*'Other Graphs'!$A$12*D285)*'Other Graphs'!$A$9*I285,-1*'Other Graphs'!$A$6*H285+EXP(-1*'Other Graphs'!$A$12*D285)*'Other Graphs'!$A$9*I285)","v":48.383420327301508},{"$f":"(LN('Other Graphs'!$A$6/'Other Graphs'!$A$9)+(D285+0.5*'Other Graphs'!$A$15^2)*'Other Graphs'!$A$12)/('Other Graphs'!$A$15*SQRT('Other Graphs'!$A$12))","v":1.8186533479473217},{"$f":"F285-'Other Graphs'!$A$15*SQRT('Other Graphs'!$A$12)","v":1.4722431864335461},0.96551783333047303,0.92952239042781437,172.70464816424877,null,null,0.19000000000000009,{"$f":"IF($C$4, 'Other Graphs'!$A$6*Q285-EXP(-1*'Other Graphs'!$A$12*'Other Graphs'!$A$3)*'Other Graphs'!$A$9*R285,-1*'Other Graphs'!$A$6*Q285+EXP(-1*'Other Graphs'!$A$12*'Other Graphs'!$A$3)*'Other Graphs'!$A$9*R285)","v":19.824885964694587},{"$f":"(LN('Other Graphs'!$A$6/'Other Graphs'!$A$9)+('Other Graphs'!$A$3+0.5*M285^2)*'Other Graphs'!$A$12)/(M285*SQRT('Other Graphs'!$A$12))","v":0.48360681758699442},{"$f":"O285-M285*SQRT('Other Graphs'!$A$12)","v":0.15451716414890759},0.6856675322831175,0.56139901064619724,67.684425622630272]
[null,null,null,0.19500000000000009,{"$f":"IF($C$4, 'Other Graphs'!$A$6*H286-EXP(-1*'Other Graphs'!$A$12*D286)*'Other Graphs'!$A$9*I286,-1*'Other Graphs'!$A$6*H286+EXP(-1*'Other Graphs'!$A$12*D286)*'Other Graphs'!$A$9*I286)","v":49.246943568122752},{"$f":"(LN('Other Graphs'!$A$6/'Other Graphs'!$A$9)+(D286+0.5*'Other Graphs'!$A$15^2)*'Other Graphs'!$A$12)/('Other Graphs'!$A$15*SQRT('Other Graphs'!$A$12))","v":1.8619546181365438},{"$f":"F286-'Other Graphs'!$A$15*SQRT('Other Graphs'!$A$12)","v":1.5155444566227683},0.96869525634447662,0.93518270956049365,171.13334818692593,null,null,0.19500000000000009,{"$f":"IF($C$4, 'Other Graphs'!$A$6*Q286-EXP(-1*'Other Graphs'!$A$12*'Other Graphs'!$A$3)*'Other Graphs'!$A$9*R286,-1*'Other Graphs'!$A$6*Q286+EXP(-1*'Other Graphs'!$A$12*'Other Graphs'!$A$3)*'Other Graphs'!$A$9*R286)","v":20.163308092807739},{"$f":"(LN('Other Graphs'!$A$6/'Other Graphs'!$A$9)+('Other Graphs'!$A$3+0.5*M286^2)*'Other Graphs'!$A$12)/(M286*SQRT('Other Graphs'!$A$12))","v":0.47975586791699476},{"$f":"O286-M286*SQRT('Other Graphs'!$A$12)","v":0.14200596044106356},0.68429950150210306,0.55646235117448195,67.802873773642546]
[null,null,null,0.20000000000000009,{"$f":"IF($C$4, 'Other Graphs'!$A$6*H287-EXP(-1*'Other Graphs'!$A$12*D287)*'Other Graphs'!$A$9*I287,-1*'Other Graphs'!$A$6*H287+EXP(-1*'Other Graphs'!$A$12*D287)*'Other Graphs'!$A$9*I287)","v":50.102610309057383},{"$f":"(LN('Other Graphs'!$A$6/'Other Graphs'!$A$9)+(D287+0.5*'Other Graphs'!$A$15^2)*'Other Graphs'!$A$12)/('Other Graphs'!$A$15*SQRT('Other Graphs'!$A$12))","v":1.9052558883257658},{"$f":"F287-'Other Graphs'!$A$15*SQRT('Other Graphs'!$A$12)","v":1.5588457268119904},0.9716265917553093,0.94048355077149615,169.50714316037633,null,null,0.20000000000000009,{"$f":"IF($C$4, 'Other Graphs'!$A$6*Q287-EXP(-1*'Other Graphs'!$A$12*'Other Graphs'!$A$3)*'Other Graphs'!$A$9*R287,-1*'Other Graphs'!$A$6*Q287+EXP(-1*'Other Graphs'!$A$12*'Other Graphs'!$A$3)*'Other Graphs'!$A$9*R287)","v":20.502322461675952},{"$f":"(LN('Other Graphs'!$A$6/'Other Graphs'!$A$9)+('Other Graphs'!$A$3+0.5*M287^2)*'Other Graphs'!$A$12)/(M287*SQRT('Other Graphs'!$A$12))","v":0.47631397208144122},{"$f":"O287-M287*SQRT('Other Graphs'!$A$12)","v":0.12990381056766559},0.68307464361323722,0.55167873527964106,67.907933375433004]
[null,null,null,0.2050000000000001,{"$f":"IF($C$4, 'Other Graphs'!$A$6*H288-EXP(-1*'Other Graphs'!$A$12*D288)*'Other Graphs'!$A$9*I288,-1*'Other Graphs'!$A$6*H288+EXP(-1*'Other Graphs'!$A$12*D288)*'Other Graphs'!$A$9*I288)","v":50.950146024859265},{"$f":"(LN('Other Graphs'!$A$6/'Other Graphs'!$A$9)+(D288+0.5*'Other Graphs'!$A$15^2)*'Other Graphs'!$A$12)/('Other Graphs'!$A$15*SQRT('Other Graphs'!$A$12))","v":1.9485571585149877},{"$f":"F288-'Other Graphs'!$A$15*SQRT('Other Graphs'!$A$12)","v":1.6021469970012121},0.97432583371836978,0.9454384462451576,167.8313908095403,null,null,0.2050000000000001,{"$f":"IF($C$4, 'Other Graphs'!$A$6*Q288-EXP(-1*'Other Graphs'!$A$12*'Other Graphs'!$A$3)*'Other Graphs'!$A$9*R288,-1*'Other Graphs'!$A$6*Q288+EXP(-1*'Other Graphs'!$A$12*'Other Graphs'!$A$3)*'Other Graphs'!$A$9*R288)","v":20.841862128553117},{"$f":"(LN('Other Graphs'!$A$6/'Other Graphs'!$A$9)+('Other Graphs'!$A$3+0.5*M288^2)*'Other Graphs'!$A$12)/(M288*SQRT('Other Graphs'!$A$12))","v":0.47325119931195969},{"$f":"O288-M288*SQRT('Other Graphs'!$A$12)","v":0.11818078376033969},0.68198301300233288,0.54703779220809223,68.000716593860432]
[null,null,null,0.2100000000000001,{"$f":"IF($C$4, 'Other Graphs'!$A$6*H289-EXP(-1*'Other Graphs'!$A$12*D289)*'Other Graphs'!$A$9*I289,-1*'Other Graphs'!$A$6*H289+EXP(-1*'Other Graphs'!$A$12*D289)*'Other Graphs'!$A$9*I289)","v":51.789302978906967},{"$f":"(LN('Other Graphs'!$A$6/'Other Graphs'!$A$9)+(D289+0.5*'Other Graphs'!$A$15^2)*'Other Graphs'!$A$12)/('Other Graphs'!$A$15*SQRT('Other Graphs'!$A$12))","v":1.9918584287042096},{"$f":"F289-'Other Graphs'!$A$15*SQRT('Other Graphs'!$A$12)","v":1.6454482671904342},0.97680670335930075,0.95006129861536803,166.11127092971273,null,null,0.2100000000000001,{"$f":"IF($C$4, 'Other Graphs'!$A$6*Q289-EXP(-1*'Other Graphs'!$A$12*'Other Graphs'!$A$3)*'Other Graphs'!$A$9*R289,-1*'Other Graphs'!$A$6*Q289+EXP(-1*'Other Graphs'!$A$12*'Other Graphs'!$A$3)*'Other Graphs'!$A$9*R289)","v":21.18186571152242},{"$f":"(LN('Other Graphs'!$A$6/'Other Graphs'!$A$9)+('Other Graphs'!$A$3+0.5*M289^2)*'Other Graphs'!$A$12)/(M289*SQRT('Other Graphs'!$A$12))","v":0.47054046938954502},{"$f":"O289-M289*SQRT('Other Graphs'!$A$12)","v":0.10680979980008065},0.68101553604177978,0.54253006358124978,68.082212320614076]
[null,null,null,0.21500000000000011,{"$f":"IF($C$4, 'Other Graphs'!$A$6*H290-EXP(-1*'Other Graphs'!$A$12*D290)*'Other Graphs'!$A$9*I290,-1*'Other Graphs'!$A$6*H290+EXP(-1*'Other Graphs'!$A$12*D290)*'Other Graphs'!$A$9*I290)","v":52.619859333555532},{"$f":"(LN('Other Graphs'!$A$6/'Other Graphs'!$A$9)+(D290+0.5*'Other Graphs'!$A$15^2)*'Other Graphs'!$A$12)/('Other Graphs'!$A$15*SQRT('Other Graphs'!$A$12))","v":2.0351596988934317},{"$f":"F290-'Other Graphs'!$A$15*SQRT('Other Graphs'!$A$12)","v":1.6887495373796564},0.97908259665873598,0.9543662809822433,164.3517720435851,null,null,0.21500000000000011,{"$f":"IF($C$4, 'Other Graphs'!$A$6*Q290-EXP(-1*'Other Graphs'!$A$12*'Other Graphs'!$A$3)*'Other Graphs'!$A$9*R290,-1*'Other Graphs'!$A$6*Q290+EXP(-1*'Other Graphs'!$A$12*'Other Graphs'!$A$3)*'Other Graphs'!$A$9*R290)","v":21.52227677312549},{"$f":"(LN('Other Graphs'!$A$6/'Other Graphs'!$A$9)+('Other Graphs'!$A$3+0.5*M290^2)*'Other Graphs'!$A$12)/(M290*SQRT('Other Graphs'!$A$12))","v":0.46815722118533204},{"$f":"O290-M290*SQRT('Other Graphs'!$A$12)","v":9.5766297558023239E-2},0.68016391917326291,0.53814690752574856,68.153302146018234]
[null,null,null,0.22000000000000011,{"$f":"IF($C$4, 'Other Graphs'!$A$6*H291-EXP(-1*'Other Graphs'!$A$12*D291)*'Other Graphs'!$A$9*I291,-1*'Other Graphs'!$A$6*H291+EXP(-1*'Other Graphs'!$A$12*D291)*'Other Graphs'!$A$9*I291)","v":53.441618193773458},{"$f":"(LN('Other Graphs'!$A$6/'Other Graphs'!$A$9)+(D291+0.5*'Other Graphs'!$A$15^2)*'Other Graphs'!$A$12)/('Other Graphs'!$A$15*SQRT('Other Graphs'!$A$12))","v":2.0784609690826534},{"$f":"F291-'Other Graphs'!$A$15*SQRT('Other Graphs'!$A$12)","v":1.7320508075688781},0.98116653888568572,0.9583677416682248,162.55768038284216,null,null,0.22000000000000011,{"$f":"IF($C$4, 'Other Graphs'!$A$6*Q291-EXP(-1*'Other Graphs'!$A$12*'Other Graphs'!$A$3)*'Other Graphs'!$A$9*R291,-1*'Other Graphs'!$A$6*Q291+EXP(-1*'Other Graphs'!$A$12*'Other Graphs'!$A$3)*'Other Graphs'!$A$9*R291)","v":21.863043283855582},{"$f":"(LN('Other Graphs'!$A$6/'Other Graphs'!$A$9)+('Other Graphs'!$A$3+0.5*M291^2)*'Other Graphs'!$A$12)/(M291*SQRT('Other Graphs'!$A$12))","v":0.46607912640035248},{"$f":"O291-M291*SQRT('Other Graphs'!$A$12)","v":8.502794873519931E-2},0.67942056811837603,0.53388041435712286,68.21477398918455]
[null,null,null,0.22500000000000012,{"$f":"IF($C$4, 'Other Graphs'!$A$6*H292-EXP(-1*'Other Graphs'!$A$12*D292)*'Other Graphs'!$A$9*I292,-1*'Other Graphs'!$A$6*H292+EXP(-1*'Other Graphs'!$A$12*D292)*'Other Graphs'!$A$9*I292)","v":54.254406595687669},{"$f":"(LN('Other Graphs'!$A$6/'Other Graphs'!$A$9)+(D292+0.5*'Other Graphs'!$A$15^2)*'Other Graphs'!$A$12)/('Other Graphs'!$A$15*SQRT('Other Graphs'!$A$12))","v":2.1217622392718756},{"$f":"F292-'Other Graphs'!$A$15*SQRT('Other Graphs'!$A$12)","v":1.7753520777581002},0.98307114545325147,0.96208011425275863,160.73357110849983,null,null,0.22500000000000012,{"$f":"IF($C$4, 'Other Graphs'!$A$6*Q292-EXP(-1*'Other Graphs'!$A$12*'Other Graphs'!$A$3)*'Other Graphs'!$A$9*R292,-1*'Other Graphs'!$A$6*Q292+EXP(-1*'Other Graphs'!$A$12*'Other Graphs'!$A$3)*'Other Graphs'!$A$9*R292)","v":22.204117153801505},{"$f":"(LN('Other Graphs'!$A$6/'Other Graphs'!$A$9)+('Other Graphs'!$A$3+0.5*M292^2)*'Other Graphs'!$A$12)/(M292*SQRT('Other Graphs'!$A$12))","v":0.46428584147332408},{"$f":"O292-M292*SQRT('Other Graphs'!$A$12)","v":7.4574409770326533E-2},0.67877851671896339,0.52972333227118329,68.267333766640036]
[null,null,null,0.23000000000000012,{"$f":"IF($C$4, 'Other Graphs'!$A$6*H293-EXP(-1*'Other Graphs'!$A$12*D293)*'Other Graphs'!$A$9*I293,-1*'Other Graphs'!$A$6*H293+EXP(-1*'Other Graphs'!$A$12*D293)*'Other Graphs'!$A$9*I293)","v":55.058074451230169},{"$f":"(LN('Other Graphs'!$A$6/'Other Graphs'!$A$9)+(D293+0.5*'Other Graphs'!$A$15^2)*'Other Graphs'!$A$12)/('Other Graphs'!$A$15*SQRT('Other Graphs'!$A$12))","v":2.1650635094610977},{"$f":"F293-'Other Graphs'!$A$15*SQRT('Other Graphs'!$A$12)","v":1.8186533479473224},0.98480858901171131,0.96551783333047303,158.88380166741442,null,null,0.23000000000000012,{"$f":"IF($C$4, 'Other Graphs'!$A$6*Q293-EXP(-1*'Other Graphs'!$A$12*'Other Graphs'!$A$3)*'Other Graphs'!$A$9*R293,-1*'Other Graphs'!$A$6*Q293+EXP(-1*'Other Graphs'!$A$12*'Other Graphs'!$A$3)*'Other Graphs'!$A$9*R293)","v":22.545453822634705},{"$f":"(LN('Other Graphs'!$A$6/'Other Graphs'!$A$9)+('Other Graphs'!$A$3+0.5*M293^2)*'Other Graphs'!$A$12)/(M293*SQRT('Other Graphs'!$A$12))","v":0.46275879184829355},{"$f":"O293-M293*SQRT('Other Graphs'!$A$12)","v":6.4387106107451575E-2},0.67823136412727369,0.52566900172050524,68.311615413058689]
[null,null,null,0.23500000000000013,{"$f":"IF($C$4, 'Other Graphs'!$A$6*H294-EXP(-1*'Other Graphs'!$A$12*D294)*'Other Graphs'!$A$9*I294,-1*'Other Graphs'!$A$6*H294+EXP(-1*'Other Graphs'!$A$12*D294)*'Other Graphs'!$A$9*I294)","v":55.852493459567242},{"$f":"(LN('Other Graphs'!$A$6/'Other Graphs'!$A$9)+(D294+0.5*'Other Graphs'!$A$15^2)*'Other Graphs'!$A$12)/('Other Graphs'!$A$15*SQRT('Other Graphs'!$A$12))","v":2.2083647796503194},{"$f":"F294-'Other Graphs'!$A$15*SQRT('Other Graphs'!$A$12)","v":1.8619546181365441},0.98639057254257723,0.96869525634447662,157.01250716830785,null,null,0.23500000000000013,{"$f":"IF($C$4, 'Other Graphs'!$A$6*Q294-EXP(-1*'Other Graphs'!$A$12*'Other Graphs'!$A$3)*'Other Graphs'!$A$9*R294,-1*'Other Graphs'!$A$6*Q294+EXP(-1*'Other Graphs'!$A$12*'Other Graphs'!$A$3)*'Other Graphs'!$A$9*R294)","v":22.887011899699999},{"$f":"(LN('Other Graphs'!$A$6/'Other Graphs'!$A$9)+('Other Graphs'!$A$3+0.5*M294^2)*'Other Graphs'!$A$12)/(M294*SQRT('Other Graphs'!$A$12))","v":0.46148098378258018},{"$f":"O294-M294*SQRT('Other Graphs'!$A$12)","v":5.4449044003893832E-2},0.67777321925080125,0.52171129734286259,68.348189512650436]
[null,null,null,0.24000000000000013,{"$f":"IF($C$4, 'Other Graphs'!$A$6*H295-EXP(-1*'Other Graphs'!$A$12*D295)*'Other Graphs'!$A$9*I295,-1*'Other Graphs'!$A$6*H295+EXP(-1*'Other Graphs'!$A$12*D295)*'Other Graphs'!$A$9*I295)","v":56.637555995408782},{"$f":"(LN('Other Graphs'!$A$6/'Other Graphs'!$A$9)+(D295+0.5*'Other Graphs'!$A$15^2)*'Other Graphs'!$A$12)/('Other Graphs'!$A$15*SQRT('Other Graphs'!$A$12))","v":2.2516660498395416},{"$f":"F295-'Other Graphs'!$A$15*SQRT('Other Graphs'!$A$12)","v":1.9052558883257662},0.9878283081731295,0.97162659175530941,155.12359764908425,null,null,0.24000000000000013,{"$f":"IF($C$4, 'Other Graphs'!$A$6*Q295-EXP(-1*'Other Graphs'!$A$12*'Other Graphs'!$A$3)*'Other Graphs'!$A$9*R295,-1*'Other Graphs'!$A$6*Q295+EXP(-1*'Other Graphs'!$A$12*'Other Graphs'!$A$3)*'Other Graphs'!$A$9*R295)","v":23.228752847263252},{"$f":"(LN('Other Graphs'!$A$6/'Other Graphs'!$A$9)+('Other Graphs'!$A$3+0.5*M295^2)*'Other Graphs'!$A$12)/(M295*SQRT('Other Graphs'!$A$12))","v":0.46043683967872662},{"$f":"O295-M295*SQRT('Other Graphs'!$A$12)","v":4.4744645862195842E-2},0.67739865151322753,0.51784457646924686,68.377570755598015]
[null,null,null,0.24500000000000013,{"$f":"IF($C$4, 'Other Graphs'!$A$6*H296-EXP(-1*'Other Graphs'!$A$12*D296)*'Other Graphs'!$A$9*I296,-1*'Other Graphs'!$A$6*H296+EXP(-1*'Other Graphs'!$A$12*D296)*'Other Graphs'!$A$9*I296)","v":57.413173983654204},{"$f":"(LN('Other Graphs'!$A$6/'Other Graphs'!$A$9)+(D296+0.5*'Other Graphs'!$A$15^2)*'Other Graphs'!$A$12)/('Other Graphs'!$A$15*SQRT('Other Graphs'!$A$12))","v":2.2949673200287637},{"$f":"F296-'Other Graphs'!$A$15*SQRT('Other Graphs'!$A$12)","v":1.9485571585149883},0.9891325013941703,0.97432583371836978,153.22075709838927,null,null,0.24500000000000013,{"$f":"IF($C$4, 'Other Graphs'!$A$6*Q296-EXP(-1*'Other Graphs'!$A$12*'Other Graphs'!$A$3)*'Other Graphs'!$A$9*R296,-1*'Other Graphs'!$A$6*Q296+EXP(-1*'Other Graphs'!$A$12*'Other Graphs'!$A$3)*'Other Graphs'!$A$9*R296)","v":23.570640701041242},{"$f":"(LN('Other Graphs'!$A$6/'Other Graphs'!$A$9)+('Other Graphs'!$A$3+0.5*M296^2)*'Other Graphs'!$A$12)/(M296*SQRT('Other Graphs'!$A$12))","v":0.45961205357988422},{"$f":"O296-M296*SQRT('Other Graphs'!$A$12)","v":3.5259605725509069E-2},0.67710264712559787,0.51406363337571337,68.400224397535993]
[null,null,null,0.25000000000000011,{"$f":"IF($C$4, 'Other Graphs'!$A$6*H297-EXP(-1*'Other Graphs'!$A$12*D297)*'Other Graphs'!$A$9*I297,-1*'Other Graphs'!$A$6*H297+EXP(-1*'Other Graphs'!$A$12*D297)*'Other Graphs'!$A$9*I297)","v":58.179277769146147},{"$f":"(LN('Other Graphs'!$A$6/'Other Graphs'!$A$9)+(D297+0.5*'Other Graphs'!$A$15^2)*'Other Graphs'!$A$12)/('Other Graphs'!$A$15*SQRT('Other Graphs'!$A$12))","v":2.3382685902179854},{"$f":"F297-'Other Graphs'!$A$15*SQRT('Other Graphs'!$A$12)","v":1.99185842870421},0.9903133403342036,0.97680670335930075,151.30744408782405,null,null,0.25000000000000011,{"$f":"IF($C$4, 'Other Graphs'!$A$6*Q297-EXP(-1*'Other Graphs'!$A$12*'Other Graphs'!$A$3)*'Other Graphs'!$A$9*R297,-1*'Other Graphs'!$A$6*Q297+EXP(-1*'Other Graphs'!$A$12*'Other Graphs'!$A$3)*'Other Graphs'!$A$9*R297)","v":23.91264182302892},{"$f":"(LN('Other Graphs'!$A$6/'Other Graphs'!$A$9)+('Other Graphs'!$A$3+0.5*M297^2)*'Other Graphs'!$A$12)/(M297*SQRT('Other Graphs'!$A$12))","v":0.45899346400575253},{"$f":"O297-M297*SQRT('Other Graphs'!$A$12)","v":2.5980762113533062E-2},0.67688057017453229,0.51036365855943788,68.416571870640951]
[null,null,null,0.25500000000000012,{"$f":"IF($C$4, 'Other Graphs'!$A$6*H298-EXP(-1*'Other Graphs'!$A$12*D298)*'Other Graphs'!$A$9*I298,-1*'Other Graphs'!$A$6*H298+EXP(-1*'Other Graphs'!$A$12*D298)*'Other Graphs'!$A$9*I298)","v":58.935814989585268},{"$f":"(LN('Other Graphs'!$A$6/'Other Graphs'!$A$9)+(D298+0.5*'Other Graphs'!$A$15^2)*'Other Graphs'!$A$12)/('Other Graphs'!$A$15*SQRT('Other Graphs'!$A$12))","v":2.3815698604072075},{"$f":"F298-'Other Graphs'!$A$15*SQRT('Other Graphs'!$A$12)","v":2.0351596988934322},0.99138048972070458,0.97908259665873598,149.38689386694776,null,null,0.25500000000000012,{"$f":"IF($C$4, 'Other Graphs'!$A$6*Q298-EXP(-1*'Other Graphs'!$A$12*'Other Graphs'!$A$3)*'Other Graphs'!$A$9*R298,-1*'Other Graphs'!$A$6*Q298+EXP(-1*'Other Graphs'!$A$12*'Other Graphs'!$A$3)*'Other Graphs'!$A$9*R298)","v":24.254724682382125},{"$f":"(LN('Other Graphs'!$A$6/'Other Graphs'!$A$9)+('Other Graphs'!$A$3+0.5*M298^2)*'Other Graphs'!$A$12)/(M298*SQRT('Other Graphs'!$A$12))","v":0.45856894174899543},{"$f":"O298-M298*SQRT('Other Graphs'!$A$12)","v":1.6895985818931536E-2},0.67672812793003423,0.50674020241823992,68.426995670475264]
[null,null,null,0.26000000000000012,{"$f":"IF($C$4, 'Other Graphs'!$A$6*H299-EXP(-1*'Other Graphs'!$A$12*D299)*'Other Graphs'!$A$9*I299,-1*'Other Graphs'!$A$6*H299+EXP(-1*'Other Graphs'!$A$12*D299)*'Other Graphs'!$A$9*I299)","v":59.682749458920007},{"$f":"(LN('Other Graphs'!$A$6/'Other Graphs'!$A$9)+(D299+0.5*'Other Graphs'!$A$15^2)*'Other Graphs'!$A$12)/('Other Graphs'!$A$15*SQRT('Other Graphs'!$A$12))","v":2.4248711305964292},{"$f":"F299-'Other Graphs'!$A$15*SQRT('Other Graphs'!$A$12)","v":2.0784609690826539},0.99234308914328406,0.98116653888568572,147.46212177160473,null,null,0.26000000000000012,{"$f":"IF($C$4, 'Other Graphs'!$A$6*Q299-EXP(-1*'Other Graphs'!$A$12*'Other Graphs'!$A$3)*'Other Graphs'!$A$9*R299,-1*'Other Graphs'!$A$6*Q299+EXP(-1*'Other Graphs'!$A$12*'Other Graphs'!$A$3)*'Other Graphs'!$A$9*R299)","v":24.596859660734502},{"$f":"(LN('Other Graphs'!$A$6/'Other Graphs'!$A$9)+('Other Graphs'!$A$3+0.5*M299^2)*'Other Graphs'!$A$12)/(M299*SQRT('Other Graphs'!$A$12))","v":0.45832729061822602},{"$f":"O299-M299*SQRT('Other Graphs'!$A$12)","v":7.9940806503177586E-3},0.67664133985698949,0.50318914279711313,68.431843622904807]
[null,null,null,0.26500000000000012,{"$f":"IF($C$4, 'Other Graphs'!$A$6*H300-EXP(-1*'Other Graphs'!$A$12*D300)*'Other Graphs'!$A$9*I300,-1*'Other Graphs'!$A$6*H300+EXP(-1*'Other Graphs'!$A$12*D300)*'Other Graphs'!$A$9*I300)","v":60.420060067778032},{"$f":"(LN('Other Graphs'!$A$6/'Other Graphs'!$A$9)+(D300+0.5*'Other Graphs'!$A$15^2)*'Other Graphs'!$A$12)/('Other Graphs'!$A$15*SQRT('Other Graphs'!$A$12))","v":2.4681724007856514},{"$f":"F300-'Other Graphs'!$A$15*SQRT('Other Graphs'!$A$12)","v":2.121762239271876},0.99320975522398314,0.98307114545325147,145.53592779575823,null,null,0.26500000000000012,{"$f":"IF($C$4, 'Other Graphs'!$A$6*Q300-EXP(-1*'Other Graphs'!$A$12*'Other Graphs'!$A$3)*'Other Graphs'!$A$9*R300,-1*'Other Graphs'!$A$6*Q300+EXP(-1*'Other Graphs'!$A$12*'Other Graphs'!$A$3)*'Other Graphs'!$A$9*R300)","v":24.939018878849026},{"$f":"(LN('Other Graphs'!$A$6/'Other Graphs'!$A$9)+('Other Graphs'!$A$3+0.5*M300^2)*'Other Graphs'!$A$12)/(M300*SQRT('Other Graphs'!$A$12))","v":0.45825815941763365},{"$f":"O300-M300*SQRT('Other Graphs'!$A$12)","v":-7.3530458811904564E-4},0.67661650988397493,0.49970665593725999,68.431432618891051]
[null,null,null,0.27000000000000013,{"$f":"IF($C$4, 'Other Graphs'!$A$6*H301-EXP(-1*'Other Graphs'!$A$12*D301)*'Other Graphs'!$A$9*I301,-1*'Other Graphs'!$A$6*H301+EXP(-1*'Other Graphs'!$A$12*D301)*'Other Graphs'!$A$9*I301)","v":61.147739706756823},{"$f":"(LN('Other Graphs'!$A$6/'Other Graphs'!$A$9)+(D301+0.5*'Other Graphs'!$A$15^2)*'Other Graphs'!$A$12)/('Other Graphs'!$A$15*SQRT('Other Graphs'!$A$12))","v":2.5114736709748735},{"$f":"F301-'Other Graphs'!$A$15*SQRT('Other Graphs'!$A$12)","v":2.1650635094610982},0.99398858729619133,0.98480858901171131,143.61090217921048,null,null,0.27000000000000013,{"$f":"IF($C$4, 'Other Graphs'!$A$6*Q301-EXP(-1*'Other Graphs'!$A$12*'Other Graphs'!$A$3)*'Other Graphs'!$A$9*R301,-1*'Other Graphs'!$A$6*Q301+EXP(-1*'Other Graphs'!$A$12*'Other Graphs'!$A$3)*'Other Graphs'!$A$9*R301)","v":25.281176041943482},{"$f":"(LN('Other Graphs'!$A$6/'Other Graphs'!$A$9)+('Other Graphs'!$A$3+0.5*M301^2)*'Other Graphs'!$A$12)/(M301*SQRT('Other Graphs'!$A$12))","v":0.45835196370665299},{"$f":"O301-M301*SQRT('Other Graphs'!$A$12)","v":-9.3017543369440792E-3},0.67665020154238853,0.49628919042466574,68.426051891205418]
[null,null,null,0.27500000000000013,{"$f":"IF($C$4, 'Other Graphs'!$A$6*H302-EXP(-1*'Other Graphs'!$A$12*D302)*'Other Graphs'!$A$9*I302,-1*'Other Graphs'!$A$6*H302+EXP(-1*'Other Graphs'!$A$12*D302)*'Other Graphs'!$A$9*I302)","v":61.865794217652876},{"$f":"(LN('Other Graphs'!$A$6/'Other Graphs'!$A$9)+(D302+0.5*'Other Graphs'!$A$15^2)*'Other Graphs'!$A$12)/('Other Graphs'!$A$15*SQRT('Other Graphs'!$A$12))","v":2.5547749411640952},{"$f":"F302-'Other Graphs'!$A$15*SQRT('Other Graphs'!$A$12)","v":2.2083647796503199},0.99468717619526481,0.98639057254257723,141.68943186699738,null,null,0.27500000000000013,{"$f":"IF($C$4, 'Other Graphs'!$A$6*Q302-EXP(-1*'Other Graphs'!$A$12*'Other Graphs'!$A$3)*'Other Graphs'!$A$9*R302,-1*'Other Graphs'!$A$6*Q302+EXP(-1*'Other Graphs'!$A$12*'Other Graphs'!$A$3)*'Other Graphs'!$A$9*R302)","v":25.623306301399509},{"$f":"(LN('Other Graphs'!$A$6/'Other Graphs'!$A$9)+('Other Graphs'!$A$3+0.5*M302^2)*'Other Graphs'!$A$12)/(M302*SQRT('Other Graphs'!$A$12))","v":0.45859981609494138},{"$f":"O302-M302*SQRT('Other Graphs'!$A$12)","v":-1.7714155986500058E-2},0.67673921563974104,0.49293344378796128,68.415965895894658]
[null,null,null,0.28000000000000014,{"$f":"IF($C$4, 'Other Graphs'!$A$6*H303-EXP(-1*'Other Graphs'!$A$12*D303)*'Other Graphs'!$A$9*I303,-1*'Other Graphs'!$A$6*H303+EXP(-1*'Other Graphs'!$A$12*D303)*'Other Graphs'!$A$9*I303)","v":62.574241376987864},{"$f":"(LN('Other Graphs'!$A$6/'Other Graphs'!$A$9)+(D303+0.5*'Other Graphs'!$A$15^2)*'Other Graphs'!$A$12)/('Other Graphs'!$A$15*SQRT('Other Graphs'!$A$12))","v":2.5980762113533173},{"$f":"F303-'Other Graphs'!$A$15*SQRT('Other Graphs'!$A$12)","v":2.251666049839542},0.99531261577028263,0.9878283081731295,139.77370770112418,null,null,0.28000000000000014,{"$f":"IF($C$4, 'Other Graphs'!$A$6*Q303-EXP(-1*'Other Graphs'!$A$12*'Other Graphs'!$A$3)*'Other Graphs'!$A$9*R303,-1*'Other Graphs'!$A$6*Q303+EXP(-1*'Other Graphs'!$A$12*'Other Graphs'!$A$3)*'Other Graphs'!$A$9*R303)","v":25.965386130878983},{"$f":"(LN('Other Graphs'!$A$6/'Other Graphs'!$A$9)+('Other Graphs'!$A$3+0.5*M303^2)*'Other Graphs'!$A$12)/(M303*SQRT('Other Graphs'!$A$12))","v":0.45899346400575253},{"$f":"O303-M303*SQRT('Other Graphs'!$A$12)","v":-2.598076211353334E-2},0.67688057017453229,0.48963634144056201,68.401416851773376]
[null,null,null,0.28500000000000014,{"$f":"IF($C$4, 'Other Graphs'!$A$6*H304-EXP(-1*'Other Graphs'!$A$12*D304)*'Other Graphs'!$A$9*I304,-1*'Other Graphs'!$A$6*H304+EXP(-1*'Other Graphs'!$A$12*D304)*'Other Graphs'!$A$9*I304)","v":63.273109915493485},{"$f":"(LN('Other Graphs'!$A$6/'Other Graphs'!$A$9)+(D304+0.5*'Other Graphs'!$A$15^2)*'Other Graphs'!$A$12)/('Other Graphs'!$A$15*SQRT('Other Graphs'!$A$12))","v":2.641377481542539},{"$f":"F304-'Other Graphs'!$A$15*SQRT('Other Graphs'!$A$12)","v":2.2949673200287637},0.9958715167369544,0.9891325013941703,137.86573221159546,null,null,0.28500000000000014,{"$f":"IF($C$4, 'Other Graphs'!$A$6*Q304-EXP(-1*'Other Graphs'!$A$12*'Other Graphs'!$A$3)*'Other Graphs'!$A$9*R304,-1*'Other Graphs'!$A$6*Q304+EXP(-1*'Other Graphs'!$A$12*'Other Graphs'!$A$3)*'Other Graphs'!$A$9*R304)","v":26.30739321513785},{"$f":"(LN('Other Graphs'!$A$6/'Other Graphs'!$A$9)+('Other Graphs'!$A$3+0.5*M304^2)*'Other Graphs'!$A$12)/(M304*SQRT('Other Graphs'!$A$12))","v":0.45952523399053247},{"$f":"O304-M304*SQRT('Other Graphs'!$A$12)","v":-3.4109246166597773E-2},0.67707148223757063,0.48639501770095867,68.382626983327498]
[null,null,null,0.29000000000000015,{"$f":"IF($C$4, 'Other Graphs'!$A$6*H305-EXP(-1*'Other Graphs'!$A$12*D305)*'Other Graphs'!$A$9*I305,-1*'Other Graphs'!$A$6*H305+EXP(-1*'Other Graphs'!$A$12*D305)*'Other Graphs'!$A$9*I305)","v":63.962438576551463},{"$f":"(LN('Other Graphs'!$A$6/'Other Graphs'!$A$9)+(D305+0.5*'Other Graphs'!$A$15^2)*'Other Graphs'!$A$12)/('Other Graphs'!$A$15*SQRT('Other Graphs'!$A$12))","v":2.6846787517317612},{"$f":"F305-'Other Graphs'!$A$15*SQRT('Other Graphs'!$A$12)","v":2.3382685902179858},0.99637002250590478,0.9903133403342036,135.96732788069505,null,null,0.29000000000000015,{"$f":"IF($C$4, 'Other Graphs'!$A$6*Q305-EXP(-1*'Other Graphs'!$A$12*'Other Graphs'!$A$3)*'Other Graphs'!$A$9*R305,-1*'Other Graphs'!$A$6*Q305+EXP(-1*'Other Graphs'!$A$12*'Other Graphs'!$A$3)*'Other Graphs'!$A$9*R305)","v":26.649306350054488},{"$f":"(LN('Other Graphs'!$A$6/'Other Graphs'!$A$9)+('Other Graphs'!$A$3+0.5*M305^2)*'Other Graphs'!$A$12)/(M305*SQRT('Other Graphs'!$A$12))","v":0.46018798180407594},{"$f":"O305-M305*SQRT('Other Graphs'!$A$12)","v":-4.2106752390898672E-2},0.67730935167681539,0.48320679865853544,68.359800505814349]
[null,null,null,0.29500000000000015,{"$f":"IF($C$4, 'Other Graphs'!$A$6*H306-EXP(-1*'Other Graphs'!$A$12*D306)*'Other Graphs'!$A$9*I306,-1*'Other Graphs'!$A$6*H306+EXP(-1*'Other Graphs'!$A$12*D306)*'Other Graphs'!$A$9*I306)","v":64.642275215954939},{"$f":"(LN('Other Graphs'!$A$6/'Other Graphs'!$A$9)+(D306+0.5*'Other Graphs'!$A$15^2)*'Other Graphs'!$A$12)/('Other Graphs'!$A$15*SQRT('Other Graphs'!$A$12))","v":2.7279800219209833},{"$f":"F306-'Other Graphs'!$A$15*SQRT('Other Graphs'!$A$12)","v":2.381569860407208},0.99681382663783191,0.99138048972070458,134.08014576260985,null,null,0.29500000000000015,{"$f":"IF($C$4, 'Other Graphs'!$A$6*Q306-EXP(-1*'Other Graphs'!$A$12*'Other Graphs'!$A$3)*'Other Graphs'!$A$9*R306,-1*'Other Graphs'!$A$6*Q306+EXP(-1*'Other Graphs'!$A$12*'Other Graphs'!$A$3)*'Other Graphs'!$A$9*R306)","v":26.99110535258356},{"$f":"(LN('Other Graphs'!$A$6/'Other Graphs'!$A$9)+('Other Graphs'!$A$3+0.5*M306^2)*'Other Graphs'!$A$12)/(M306*SQRT('Other Graphs'!$A$12))","v":0.4609750475567847},{"$f":"O306-M306*SQRT('Other Graphs'!$A$12)","v":-4.997994067603434E-2},0.67759174633060615,0.48006918668119009,68.333125385690551]
[null,null,null,0.30000000000000016,{"$f":"IF($C$4, 'Other Graphs'!$A$6*H307-EXP(-1*'Other Graphs'!$A$12*D307)*'Other Graphs'!$A$9*I307,-1*'Other Graphs'!$A$6*H307+EXP(-1*'Other Graphs'!$A$12*D307)*'Other Graphs'!$A$9*I307)","v":65.312675944767989},{"$f":"(LN('Other Graphs'!$A$6/'Other Graphs'!$A$9)+(D307+0.5*'Other Graphs'!$A$15^2)*'Other Graphs'!$A$12)/('Other Graphs'!$A$15*SQRT('Other Graphs'!$A$12))","v":2.771281292110205},{"$f":"F307-'Other Graphs'!$A$15*SQRT('Other Graphs'!$A$12)","v":2.4248711305964297},0.99720819159681062,0.99234308914328406,132.20567434883026,null,null,0.30000000000000016,{"$f":"IF($C$4, 'Other Graphs'!$A$6*Q307-EXP(-1*'Other Graphs'!$A$12*'Other Graphs'!$A$3)*'Other Graphs'!$A$9*R307,-1*'Other Graphs'!$A$6*Q307+EXP(-1*'Other Graphs'!$A$12*'Other Graphs'!$A$3)*'Other Graphs'!$A$9*R307)","v":27.332770979512013},{"$f":"(LN('Other Graphs'!$A$6/'Other Graphs'!$A$9)+('Other Graphs'!$A$3+0.5*M307^2)*'Other Graphs'!$A$12)/(M307*SQRT('Other Graphs'!$A$12))","v":0.4618802153517006},{"$f":"O307-M307*SQRT('Other Graphs'!$A$12)","v":-5.7735026918962873E-2},0.67791638865814496,0.4769798463860192,68.302774904884643]
[null,null,null,0.30500000000000016,{"$f":"IF($C$4, 'Other Graphs'!$A$6*H308-EXP(-1*'Other Graphs'!$A$12*D308)*'Other Graphs'!$A$9*I308,-1*'Other Graphs'!$A$6*H308+EXP(-1*'Other Graphs'!$A$12*D308)*'Other Graphs'!$A$9*I308)","v":65.973704316512141},{"$f":"(LN('Other Graphs'!$A$6/'Other Graphs'!$A$9)+(D308+0.5*'Other Graphs'!$A$15^2)*'Other Graphs'!$A$12)/('Other Graphs'!$A$15*SQRT('Other Graphs'!$A$12))","v":2.8145825622994272},{"$f":"F308-'Other Graphs'!$A$15*SQRT('Other Graphs'!$A$12)","v":2.4681724007856518},0.99755796849472622,0.99320975522398314,130.34524857899601,null,null,0.30500000000000016,{"$f":"IF($C$4, 'Other Graphs'!$A$6*Q308-EXP(-1*'Other Graphs'!$A$12*'Other Graphs'!$A$3)*'Other Graphs'!$A$9*R308,-1*'Other Graphs'!$A$6*Q308+EXP(-1*'Other Graphs'!$A$12*'Other Graphs'!$A$3)*'Other Graphs'!$A$9*R308)","v":27.674284854036436},{"$f":"(LN('Other Graphs'!$A$6/'Other Graphs'!$A$9)+('Other Graphs'!$A$3+0.5*M308^2)*'Other Graphs'!$A$12)/(M308*SQRT('Other Graphs'!$A$12))","v":0.462897676891666},{"$f":"O308-M308*SQRT('Other Graphs'!$A$12)","v":-6.5377819416841787E-2},0.67828114361687286,0.47393659191596749,68.268909053368475]
[null,null,null,0.31000000000000016,{"$f":"IF($C$4, 'Other Graphs'!$A$6*H309-EXP(-1*'Other Graphs'!$A$12*D309)*'Other Graphs'!$A$9*I309,-1*'Other Graphs'!$A$6*H309+EXP(-1*'Other Graphs'!$A$12*D309)*'Other Graphs'!$A$9*I309)","v":66.625430559407121},{"$f":"(LN('Other Graphs'!$A$6/'Other Graphs'!$A$9)+(D309+0.5*'Other Graphs'!$A$15^2)*'Other Graphs'!$A$12)/('Other Graphs'!$A$15*SQRT('Other Graphs'!$A$12))","v":2.8578838324886493},{"$f":"F309-'Other Graphs'!$A$15*SQRT('Other Graphs'!$A$12)","v":2.511473670974874},0.9978676175429847,0.99398858729619133,128.50005890587386,null,null,0.31000000000000016,{"$f":"IF($C$4, 'Other Graphs'!$A$6*Q309-EXP(-1*'Other Graphs'!$A$12*'Other Graphs'!$A$3)*'Other Graphs'!$A$9*R309,-1*'Other Graphs'!$A$6*Q309+EXP(-1*'Other Graphs'!$A$12*'Other Graphs'!$A$3)*'Other Graphs'!$A$9*R309)","v":28.015629399303279},{"$f":"(LN('Other Graphs'!$A$6/'Other Graphs'!$A$9)+('Other Graphs'!$A$3+0.5*M309^2)*'Other Graphs'!$A$12)/(M309*SQRT('Other Graphs'!$A$12))","v":0.46402199860837184},{"$f":"O309-M309*SQRT('Other Graphs'!$A$12)","v":-7.291375173798037E-2},0.67868400765440051,0.47093737538411723,68.231675771141852]
[null,null,null,0.31500000000000017,{"$f":"IF($C$4, 'Other Graphs'!$A$6*H310-EXP(-1*'Other Graphs'!$A$12*D310)*'Other Graphs'!$A$9*I310,-1*'Other Graphs'!$A$6*H310+EXP(-1*'Other Graphs'!$A$12*D310)*'Other Graphs'!$A$9*I310)","v":67.267930853936491},{"$f":"(LN('Other Graphs'!$A$6/'Other Graphs'!$A$9)+(D310+0.5*'Other Graphs'!$A$15^2)*'Other Graphs'!$A$12)/('Other Graphs'!$A$15*SQRT('Other Graphs'!$A$12))","v":2.901185102677871},{"$f":"F310-'Other Graphs'!$A$15*SQRT('Other Graphs'!$A$12)","v":2.5547749411640956},0.99814122895174706,0.99468717619526481,126.67116033277625,null,null,0.31500000000000017,{"$f":"IF($C$4, 'Other Graphs'!$A$6*Q310-EXP(-1*'Other Graphs'!$A$12*'Other Graphs'!$A$3)*'Other Graphs'!$A$9*R310,-1*'Other Graphs'!$A$6*Q310+EXP(-1*'Other Graphs'!$A$12*'Other Graphs'!$A$3)*'Other Graphs'!$A$9*R310)","v":28.356787778158989},{"$f":"(LN('Other Graphs'!$A$6/'Other Graphs'!$A$9)+('Other Graphs'!$A$3+0.5*M310^2)*'Other Graphs'!$A$12)/(M310*SQRT('Other Graphs'!$A$12))","v":0.46524809192197347},{"$f":"O310-M310*SQRT('Other Graphs'!$A$12)","v":-8.034791246222317E-2},0.67912309869830267,0.46798027636361161,68.191212057939708]
[null,null,null,0.32000000000000017,{"$f":"IF($C$4, 'Other Graphs'!$A$6*H311-EXP(-1*'Other Graphs'!$A$12*D311)*'Other Graphs'!$A$9*I311,-1*'Other Graphs'!$A$6*H311+EXP(-1*'Other Graphs'!$A$12*D311)*'Other Graphs'!$A$9*I311)","v":67.901286655600373},{"$f":"(LN('Other Graphs'!$A$6/'Other Graphs'!$A$9)+(D311+0.5*'Other Graphs'!$A$15^2)*'Other Graphs'!$A$12)/('Other Graphs'!$A$15*SQRT('Other Graphs'!$A$12))","v":2.9444863728670927},{"$f":"F311-'Other Graphs'!$A$15*SQRT('Other Graphs'!$A$12)","v":2.5980762113533173},0.9983825440415427,0.99531261577028263,124.85948135065985,null,null,0.32000000000000017,{"$f":"IF($C$4, 'Other Graphs'!$A$6*Q311-EXP(-1*'Other Graphs'!$A$12*'Other Graphs'!$A$3)*'Other Graphs'!$A$9*R311,-1*'Other Graphs'!$A$6*Q311+EXP(-1*'Other Graphs'!$A$12*'Other Graphs'!$A$3)*'Other Graphs'!$A$9*R311)","v":28.697743838448687},{"$f":"(LN('Other Graphs'!$A$6/'Other Graphs'!$A$9)+('Other Graphs'!$A$3+0.5*M311^2)*'Other Graphs'!$A$12)/(M311*SQRT('Other Graphs'!$A$12))","v":0.4665711862888664},{"$f":"O311-M311*SQRT('Other Graphs'!$A$12)","v":-8.7685072133174558E-2},0.67959664704071143,0.46506349231541549,68.147644966373321]
[null,null,null,0.32500000000000018,{"$f":"IF($C$4, 'Other Graphs'!$A$6*H312-EXP(-1*'Other Graphs'!$A$12*D312)*'Other Graphs'!$A$9*I312,-1*'Other Graphs'!$A$6*H312+EXP(-1*'Other Graphs'!$A$12*D312)*'Other Graphs'!$A$9*I312)","v":68.525584062353673},{"$f":"(LN('Other Graphs'!$A$6/'Other Graphs'!$A$9)+(D312+0.5*'Other Graphs'!$A$15^2)*'Other Graphs'!$A$12)/('Other Graphs'!$A$15*SQRT('Other Graphs'!$A$12))","v":2.9877876430563148},{"$f":"F312-'Other Graphs'!$A$15*SQRT('Other Graphs'!$A$12)","v":2.6413774815425395},{"$f":"IF($C$4,NORMSDIST(F312),NORMSDIST(-1*F312))","v":0.99859497635682859},{"$f":"IF($C$4,NORMSDIST(G312),NORMSDIST(-1*G312))","v":0.9958715167369544},{"$f":"(E313-E312)/(D313-D312)","v":123.06583271167415},null,null,{"$f":"M311+0.005","v":0.32500000000000018},{"$f":"IF($C$4, 'Other Graphs'!$A$6*Q312-EXP(-1*'Other Graphs'!$A$12*'Other Graphs'!$A$3)*'Other Graphs'!$A$9*R312,-1*'Other Graphs'!$A$6*Q312+EXP(-1*'Other Graphs'!$A$12*'Other Graphs'!$A$3)*'Other Graphs'!$A$9*R312)","v":29.038482063280554},{"$f":"(LN('Other Graphs'!$A$6/'Other Graphs'!$A$9)+('Other Graphs'!$A$3+0.5*M312^2)*'Other Graphs'!$A$12)/(M312*SQRT('Other Graphs'!$A$12))","v":0.46798680473736026},{"$f":"O312-M312*SQRT('Other Graphs'!$A$12)","v":-9.4929707722525125E-2},{"$f":"IF($C$4,NORMSDIST(O312),NORMSDIST(-1*O312))","v":0.68010298702651961},{"$f":"IF($C$4,NORMSDIST(P312),NORMSDIST(-1*P312))","v":0.46218532985851352},{"$f":"(N313-N312)/(M313-M312)","v":68.101092492304304}]
[null,null,null,{"$f":"D312+0.005","v":0.33000000000000018},{"$f":"IF($C$4, 'Other Graphs'!$A$6*H313-EXP(-1*'Other Graphs'!$A$12*D313)*'Other Graphs'!$A$9*I313,-1*'Other Graphs'!$A$6*H313+EXP(-1*'Other Graphs'!$A$12*D313)*'Other Graphs'!$A$9*I313)","v":69.140913225912044},{"$f":"(LN('Other Graphs'!$A$6/'Other Graphs'!$A$9)+(D313+0.5*'Other Graphs'!$A$15^2)*'Other Graphs'!$A$12)/('Other Graphs'!$A$15*SQRT('Other Graphs'!$A$12))","v":3.0310889132455374},{"$f":"F313-'Other Graphs'!$A$15*SQRT('Other Graphs'!$A$12)","v":2.6846787517317621},0.99878163259550545,0.99637002250590478,121.29091598454227,null,null,0.33000000000000018,{"$f":"IF($C$4, 'Other Graphs'!$A$6*Q313-EXP(-1*'Other Graphs'!$A$12*'Other Graphs'!$A$3)*'Other Graphs'!$A$9*R313,-1*'Other Graphs'!$A$6*Q313+EXP(-1*'Other Graphs'!$A$12*'Other Graphs'!$A$3)*'Other Graphs'!$A$9*R313)","v":29.378987525742076},{"$f":"(LN('Other Graphs'!$A$6/'Other Graphs'!$A$9)+('Other Graphs'!$A$3+0.5*M313^2)*'Other Graphs'!$A$12)/(M313*SQRT('Other Graphs'!$A$12))","v":0.46949074162738214},{"$f":"O313-M313*SQRT('Other Graphs'!$A$12)","v":-0.10208602487034768},0.68064054946438435,0.45934419679797767,68.051664374402719]
[null,null,null,0.33500000000000019,{"$f":"IF($C$4, 'Other Graphs'!$A$6*H314-EXP(-1*'Other Graphs'!$A$12*D314)*'Other Graphs'!$A$9*I314,-1*'Other Graphs'!$A$6*H314+EXP(-1*'Other Graphs'!$A$12*D314)*'Other Graphs'!$A$9*I314)","v":69.747367805834756},{"$f":"(LN('Other Graphs'!$A$6/'Other Graphs'!$A$9)+(D314+0.5*'Other Graphs'!$A$15^2)*'Other Graphs'!$A$12)/('Other Graphs'!$A$15*SQRT('Other Graphs'!$A$12))","v":3.0743901834347591},{"$f":"F314-'Other Graphs'!$A$15*SQRT('Other Graphs'!$A$12)","v":2.7279800219209838},0.99894533319228129,0.99681382663783191,119.53533184572497,null,null,0.33500000000000019,{"$f":"IF($C$4, 'Other Graphs'!$A$6*Q314-EXP(-1*'Other Graphs'!$A$12*'Other Graphs'!$A$3)*'Other Graphs'!$A$9*R314,-1*'Other Graphs'!$A$6*Q314+EXP(-1*'Other Graphs'!$A$12*'Other Graphs'!$A$3)*'Other Graphs'!$A$9*R314)","v":29.71924584761409},{"$f":"(LN('Other Graphs'!$A$6/'Other Graphs'!$A$9)+('Other Graphs'!$A$3+0.5*M314^2)*'Other Graphs'!$A$12)/(M314*SQRT('Other Graphs'!$A$12))","v":0.47107904240184895},{"$f":"O314-M314*SQRT('Other Graphs'!$A$12)","v":-0.10915797813372519},0.68120785468879763,0.45653859483581577,67.999462813162324]
[null,null,null,0.34000000000000019,{"$f":"IF($C$4, 'Other Graphs'!$A$6*H315-EXP(-1*'Other Graphs'!$A$12*D315)*'Other Graphs'!$A$9*I315,-1*'Other Graphs'!$A$6*H315+EXP(-1*'Other Graphs'!$A$12*D315)*'Other Graphs'!$A$9*I315)","v":70.345044465063381},{"$f":"(LN('Other Graphs'!$A$6/'Other Graphs'!$A$9)+(D315+0.5*'Other Graphs'!$A$15^2)*'Other Graphs'!$A$12)/('Other Graphs'!$A$15*SQRT('Other Graphs'!$A$12))","v":3.1176914536239808},{"$f":"F315-'Other Graphs'!$A$15*SQRT('Other Graphs'!$A$12)","v":2.7712812921102055},0.99908863241680435,0.99720819159681062,117.79958806843628,null,null,0.34000000000000019,{"$f":"IF($C$4, 'Other Graphs'!$A$6*Q315-EXP(-1*'Other Graphs'!$A$12*'Other Graphs'!$A$3)*'Other Graphs'!$A$9*R315,-1*'Other Graphs'!$A$6*Q315+EXP(-1*'Other Graphs'!$A$12*'Other Graphs'!$A$3)*'Other Graphs'!$A$9*R315)","v":30.059243161679902},{"$f":"(LN('Other Graphs'!$A$6/'Other Graphs'!$A$9)+('Other Graphs'!$A$3+0.5*M315^2)*'Other Graphs'!$A$12)/(M315*SQRT('Other Graphs'!$A$12))","v":0.47274798512468191},{"$f":"O315-M315*SQRT('Other Graphs'!$A$12)","v":-0.11614928944873665},0.68180350620944696,0.45376711289782701,67.944583118652645]
[null,null,null,0.3450000000000002,{"$f":"IF($C$4, 'Other Graphs'!$A$6*H316-EXP(-1*'Other Graphs'!$A$12*D316)*'Other Graphs'!$A$9*I316,-1*'Other Graphs'!$A$6*H316+EXP(-1*'Other Graphs'!$A$12*D316)*'Other Graphs'!$A$9*I316)","v":70.934042405405563},{"$f":"(LN('Other Graphs'!$A$6/'Other Graphs'!$A$9)+(D316+0.5*'Other Graphs'!$A$15^2)*'Other Graphs'!$A$12)/('Other Graphs'!$A$15*SQRT('Other Graphs'!$A$12))","v":3.160992723813203},{"$f":"F316-'Other Graphs'!$A$15*SQRT('Other Graphs'!$A$12)","v":2.8145825622994276},0.9992138378694605,0.99755796849472622,116.08410717900303,null,null,0.3450000000000002,{"$f":"IF($C$4, 'Other Graphs'!$A$6*Q316-EXP(-1*'Other Graphs'!$A$12*'Other Graphs'!$A$3)*'Other Graphs'!$A$9*R316,-1*'Other Graphs'!$A$6*Q316+EXP(-1*'Other Graphs'!$A$12*'Other Graphs'!$A$3)*'Other Graphs'!$A$9*R316)","v":30.398966077273165},{"$f":"(LN('Other Graphs'!$A$6/'Other Graphs'!$A$9)+('Other Graphs'!$A$3+0.5*M316^2)*'Other Graphs'!$A$12)/(M316*SQRT('Other Graphs'!$A$12))","v":0.4744940636242132},{"$f":"O316-M316*SQRT('Other Graphs'!$A$12)","v":-0.12306346498704979},0.68242618489108198,0.45102842101699397,67.887114294775529]
[null,null,null,0.3500000000000002,{"$f":"IF($C$4, 'Other Graphs'!$A$6*H317-EXP(-1*'Other Graphs'!$A$12*D317)*'Other Graphs'!$A$9*I317,-1*'Other Graphs'!$A$6*H317+EXP(-1*'Other Graphs'!$A$12*D317)*'Other Graphs'!$A$9*I317)","v":71.514462941300579},{"$f":"(LN('Other Graphs'!$A$6/'Other Graphs'!$A$9)+(D317+0.5*'Other Graphs'!$A$15^2)*'Other Graphs'!$A$12)/('Other Graphs'!$A$15*SQRT('Other Graphs'!$A$12))","v":3.2042939940024251},{"$f":"F317-'Other Graphs'!$A$15*SQRT('Other Graphs'!$A$12)","v":2.8578838324886497},0.99932302927845373,0.9978676175429847,114.38923375730202,null,null,0.3500000000000002,{"$f":"IF($C$4, 'Other Graphs'!$A$6*Q317-EXP(-1*'Other Graphs'!$A$12*'Other Graphs'!$A$3)*'Other Graphs'!$A$9*R317,-1*'Other Graphs'!$A$6*Q317+EXP(-1*'Other Graphs'!$A$12*'Other Graphs'!$A$3)*'Other Graphs'!$A$9*R317)","v":30.738401648747043},{"$f":"(LN('Other Graphs'!$A$6/'Other Graphs'!$A$9)+('Other Graphs'!$A$3+0.5*M317^2)*'Other Graphs'!$A$12)/(M317*SQRT('Other Graphs'!$A$12))","v":0.47631397208144133},{"$f":"O317-M317*SQRT('Other Graphs'!$A$12)","v":-0.12990381056766609},0.68307464361323722,0.44832126472035871,67.827139567161453]
[null,null,null,0.3550000000000002,{"$f":"IF($C$4, 'Other Graphs'!$A$6*H318-EXP(-1*'Other Graphs'!$A$12*D318)*'Other Graphs'!$A$9*I318,-1*'Other Graphs'!$A$6*H318+EXP(-1*'Other Graphs'!$A$12*D318)*'Other Graphs'!$A$9*I318)","v":72.086409110087089},{"$f":"(LN('Other Graphs'!$A$6/'Other Graphs'!$A$9)+(D318+0.5*'Other Graphs'!$A$15^2)*'Other Graphs'!$A$12)/('Other Graphs'!$A$15*SQRT('Other Graphs'!$A$12))","v":3.2475952641916468},{"$f":"F318-'Other Graphs'!$A$15*SQRT('Other Graphs'!$A$12)","v":2.9011851026778714},0.9994180765211349,0.99814122895174706,112.71524136417942,null,null,0.3550000000000002,{"$f":"IF($C$4, 'Other Graphs'!$A$6*Q318-EXP(-1*'Other Graphs'!$A$12*'Other Graphs'!$A$3)*'Other Graphs'!$A$9*R318,-1*'Other Graphs'!$A$6*Q318+EXP(-1*'Other Graphs'!$A$12*'Other Graphs'!$A$3)*'Other Graphs'!$A$9*R318)","v":31.077537346582851},{"$f":"(LN('Other Graphs'!$A$6/'Other Graphs'!$A$9)+('Other Graphs'!$A$3+0.5*M318^2)*'Other Graphs'!$A$12)/(M318*SQRT('Other Graphs'!$A$12))","v":0.47820459092068912},{"$f":"O318-M318*SQRT('Other Graphs'!$A$12)","v":-0.13667344576626261},0.6837477023645856,0.44564445987199575,67.764736860681239]
[null,null,null,0.36000000000000021,{"$f":"IF($C$4, 'Other Graphs'!$A$6*H319-EXP(-1*'Other Graphs'!$A$12*D319)*'Other Graphs'!$A$9*I319,-1*'Other Graphs'!$A$6*H319+EXP(-1*'Other Graphs'!$A$12*D319)*'Other Graphs'!$A$9*I319)","v":72.649985316907987},{"$f":"(LN('Other Graphs'!$A$6/'Other Graphs'!$A$9)+(D319+0.5*'Other Graphs'!$A$15^2)*'Other Graphs'!$A$12)/('Other Graphs'!$A$15*SQRT('Other Graphs'!$A$12))","v":3.2908965343808685},{"$f":"F319-'Other Graphs'!$A$15*SQRT('Other Graphs'!$A$12)","v":2.9444863728670931},0.99950065681040989,0.9983825440415427,111.06233908481603,null,null,0.36000000000000021,{"$f":"IF($C$4, 'Other Graphs'!$A$6*Q319-EXP(-1*'Other Graphs'!$A$12*'Other Graphs'!$A$3)*'Other Graphs'!$A$9*R319,-1*'Other Graphs'!$A$6*Q319+EXP(-1*'Other Graphs'!$A$12*'Other Graphs'!$A$3)*'Other Graphs'!$A$9*R319)","v":31.416361030886257},{"$f":"(LN('Other Graphs'!$A$6/'Other Graphs'!$A$9)+('Other Graphs'!$A$3+0.5*M319^2)*'Other Graphs'!$A$12)/(M319*SQRT('Other Graphs'!$A$12))","v":0.48016297387603885},{"$f":"O319-M319*SQRT('Other Graphs'!$A$12)","v":-0.14337531684875732},0.68444424373146073,0.44299688792968461,67.69997923205716]
[null,null,null,0.36500000000000021,{"$f":"IF($C$4, 'Other Graphs'!$A$6*H320-EXP(-1*'Other Graphs'!$A$12*D320)*'Other Graphs'!$A$9*I320,-1*'Other Graphs'!$A$6*H320+EXP(-1*'Other Graphs'!$A$12*D320)*'Other Graphs'!$A$9*I320)","v":73.205297012332068},{"$f":"(LN('Other Graphs'!$A$6/'Other Graphs'!$A$9)+(D320+0.5*'Other Graphs'!$A$15^2)*'Other Graphs'!$A$12)/('Other Graphs'!$A$15*SQRT('Other Graphs'!$A$12))","v":3.3341978045700906},{"$f":"F320-'Other Graphs'!$A$15*SQRT('Other Graphs'!$A$12)","v":2.9877876430563153},0.99957227100337709,0.99859497635682859,109.43067768220364,null,null,0.36500000000000021,{"$f":"IF($C$4, 'Other Graphs'!$A$6*Q320-EXP(-1*'Other Graphs'!$A$12*'Other Graphs'!$A$3)*'Other Graphs'!$A$9*R320,-1*'Other Graphs'!$A$6*Q320+EXP(-1*'Other Graphs'!$A$12*'Other Graphs'!$A$3)*'Other Graphs'!$A$9*R320)","v":31.754860927046543},{"$f":"(LN('Other Graphs'!$A$6/'Other Graphs'!$A$9)+('Other Graphs'!$A$3+0.5*M320^2)*'Other Graphs'!$A$12)/(M320*SQRT('Other Graphs'!$A$12))","v":0.48218633612080153},{"$f":"O320-M320*SQRT('Other Graphs'!$A$12)","v":-0.15001220864183906},0.68516320874431424,0.44037749157730344,67.632935262307058]
[null,null,null,0.37000000000000022,{"$f":"IF($C$4, 'Other Graphs'!$A$6*H321-EXP(-1*'Other Graphs'!$A$12*D321)*'Other Graphs'!$A$9*I321,-1*'Other Graphs'!$A$6*H321+EXP(-1*'Other Graphs'!$A$12*D321)*'Other Graphs'!$A$9*I321)","v":73.752450400743086},{"$f":"(LN('Other Graphs'!$A$6/'Other Graphs'!$A$9)+(D321+0.5*'Other Graphs'!$A$15^2)*'Other Graphs'!$A$12)/('Other Graphs'!$A$15*SQRT('Other Graphs'!$A$12))","v":3.3774990747593132},{"$f":"F321-'Other Graphs'!$A$15*SQRT('Other Graphs'!$A$12)","v":3.0310889132455379},0.99963425900409286,0.99878163259550545,107.82035535948172,null,null,0.37000000000000022,{"$f":"IF($C$4, 'Other Graphs'!$A$6*Q321-EXP(-1*'Other Graphs'!$A$12*'Other Graphs'!$A$3)*'Other Graphs'!$A$9*R321,-1*'Other Graphs'!$A$6*Q321+EXP(-1*'Other Graphs'!$A$12*'Other Graphs'!$A$3)*'Other Graphs'!$A$9*R321)","v":32.093025603358079},{"$f":"(LN('Other Graphs'!$A$6/'Other Graphs'!$A$9)+('Other Graphs'!$A$3+0.5*M321^2)*'Other Graphs'!$A$12)/(M321*SQRT('Other Graphs'!$A$12))","v":0.48427204335946056},{"$f":"O321-M321*SQRT('Other Graphs'!$A$12)","v":-0.15658675544102435},0.68590359304960435,0.43778527069886886,67.563669413183845]
[null,null,null,0.37500000000000022,{"$f":"IF($C$4, 'Other Graphs'!$A$6*H322-EXP(-1*'Other Graphs'!$A$12*D322)*'Other Graphs'!$A$9*I322,-1*'Other Graphs'!$A$6*H322+EXP(-1*'Other Graphs'!$A$12*D322)*'Other Graphs'!$A$9*I322)","v":74.291552177540495},{"$f":"(LN('Other Graphs'!$A$6/'Other Graphs'!$A$9)+(D322+0.5*'Other Graphs'!$A$15^2)*'Other Graphs'!$A$12)/('Other Graphs'!$A$15*SQRT('Other Graphs'!$A$12))","v":3.4208003449485349},{"$f":"F322-'Other Graphs'!$A$15*SQRT('Other Graphs'!$A$12)","v":3.0743901834347596},0.99968781424553277,0.99894533319228129,106.23142313408484,null,null,0.37500000000000022,{"$f":"IF($C$4, 'Other Graphs'!$A$6*Q322-EXP(-1*'Other Graphs'!$A$12*'Other Graphs'!$A$3)*'Other Graphs'!$A$9*R322,-1*'Other Graphs'!$A$6*Q322+EXP(-1*'Other Graphs'!$A$12*'Other Graphs'!$A$3)*'Other Graphs'!$A$9*R322)","v":32.430843950423998},{"$f":"(LN('Other Graphs'!$A$6/'Other Graphs'!$A$9)+('Other Graphs'!$A$3+0.5*M322^2)*'Other Graphs'!$A$12)/(M322*SQRT('Other Graphs'!$A$12))","v":0.48641760179225985},{"$f":"O322-M322*SQRT('Other Graphs'!$A$12)","v":-0.16310145104606949},0.68666444337792065,0.43521927866361387,67.492242351336472]
[null,null,null,0.38000000000000023,{"$f":"IF($C$4, 'Other Graphs'!$A$6*H323-EXP(-1*'Other Graphs'!$A$12*D323)*'Other Graphs'!$A$9*I323,-1*'Other Graphs'!$A$6*H323+EXP(-1*'Other Graphs'!$A$12*D323)*'Other Graphs'!$A$9*I323)","v":74.82270929321092},{"$f":"(LN('Other Graphs'!$A$6/'Other Graphs'!$A$9)+(D323+0.5*'Other Graphs'!$A$15^2)*'Other Graphs'!$A$12)/('Other Graphs'!$A$15*SQRT('Other Graphs'!$A$12))","v":3.4641016151377562},{"$f":"F323-'Other Graphs'!$A$15*SQRT('Other Graphs'!$A$12)","v":3.1176914536239808},0.99973399724743039,0.99908863241680435,104.66388982999594,null,null,0.38000000000000023,{"$f":"IF($C$4, 'Other Graphs'!$A$6*Q323-EXP(-1*'Other Graphs'!$A$12*'Other Graphs'!$A$3)*'Other Graphs'!$A$9*R323,-1*'Other Graphs'!$A$6*Q323+EXP(-1*'Other Graphs'!$A$12*'Other Graphs'!$A$3)*'Other Graphs'!$A$9*R323)","v":32.768305162180681},{"$f":"(LN('Other Graphs'!$A$6/'Other Graphs'!$A$9)+('Other Graphs'!$A$3+0.5*M323^2)*'Other Graphs'!$A$12)/(M323*SQRT('Other Graphs'!$A$12))","v":0.48862064887206236},{"$f":"O323-M323*SQRT('Other Graphs'!$A$12)","v":-0.16955865800411141},0.68744485428209257,0.43267861889457271,67.418711243504902]
[null,null,null,0.38500000000000023,{"$f":"IF($C$4, 'Other Graphs'!$A$6*H324-EXP(-1*'Other Graphs'!$A$12*D324)*'Other Graphs'!$A$9*I324,-1*'Other Graphs'!$A$6*H324+EXP(-1*'Other Graphs'!$A$12*D324)*'Other Graphs'!$A$9*I324)","v":75.3460287423609},{"$f":"(LN('Other Graphs'!$A$6/'Other Graphs'!$A$9)+(D324+0.5*'Other Graphs'!$A$15^2)*'Other Graphs'!$A$12)/('Other Graphs'!$A$15*SQRT('Other Graphs'!$A$12))","v":3.5074028853269787},{"$f":"F324-'Other Graphs'!$A$15*SQRT('Other Graphs'!$A$12)","v":3.1609927238132034},0.99977374825678489,0.9992138378694605,103.11772669756741,null,null,0.38500000000000023,{"$f":"IF($C$4, 'Other Graphs'!$A$6*Q324-EXP(-1*'Other Graphs'!$A$12*'Other Graphs'!$A$3)*'Other Graphs'!$A$9*R324,-1*'Other Graphs'!$A$6*Q324+EXP(-1*'Other Graphs'!$A$12*'Other Graphs'!$A$3)*'Other Graphs'!$A$9*R324)","v":33.105398718398206},{"$f":"(LN('Other Graphs'!$A$6/'Other Graphs'!$A$9)+('Other Graphs'!$A$3+0.5*M324^2)*'Other Graphs'!$A$12)/(M324*SQRT('Other Graphs'!$A$12))","v":0.49087894478145244},{"$f":"O324-M324*SQRT('Other Graphs'!$A$12)","v":-0.17596061613256564},0.68824396512163477,0.43016244169587203,67.343130025599805]
[null,null,null,0.39000000000000024,{"$f":"IF($C$4, 'Other Graphs'!$A$6*H325-EXP(-1*'Other Graphs'!$A$12*D325)*'Other Graphs'!$A$9*I325,-1*'Other Graphs'!$A$6*H325+EXP(-1*'Other Graphs'!$A$12*D325)*'Other Graphs'!$A$9*I325)","v":75.861617375848738},{"$f":"(LN('Other Graphs'!$A$6/'Other Graphs'!$A$9)+(D325+0.5*'Other Graphs'!$A$15^2)*'Other Graphs'!$A$12)/('Other Graphs'!$A$15*SQRT('Other Graphs'!$A$12))","v":3.5507041555162009},{"$f":"F325-'Other Graphs'!$A$15*SQRT('Other Graphs'!$A$12)","v":3.2042939940024255},0.99980789898648248,0.99932302927845373,101.59287167275571,null,null,0.39000000000000024,{"$f":"IF($C$4, 'Other Graphs'!$A$6*Q325-EXP(-1*'Other Graphs'!$A$12*'Other Graphs'!$A$3)*'Other Graphs'!$A$9*R325,-1*'Other Graphs'!$A$6*Q325+EXP(-1*'Other Graphs'!$A$12*'Other Graphs'!$A$3)*'Other Graphs'!$A$9*R325)","v":33.442114368526205},{"$f":"(LN('Other Graphs'!$A$6/'Other Graphs'!$A$9)+('Other Graphs'!$A$3+0.5*M325^2)*'Other Graphs'!$A$12)/(M325*SQRT('Other Graphs'!$A$12))","v":0.49319036456544585},{"$f":"O325-M325*SQRT('Other Graphs'!$A$12)","v":-0.18230945038641666},0.68906095727221006,0.42766994131636626,67.265549648298816]
[null,null,null,0.39500000000000024,{"$f":"IF($C$4, 'Other Graphs'!$A$6*H326-EXP(-1*'Other Graphs'!$A$12*D326)*'Other Graphs'!$A$9*I326,-1*'Other Graphs'!$A$6*H326+EXP(-1*'Other Graphs'!$A$12*D326)*'Other Graphs'!$A$9*I326)","v":76.369581734212517},{"$f":"(LN('Other Graphs'!$A$6/'Other Graphs'!$A$9)+(D326+0.5*'Other Graphs'!$A$15^2)*'Other Graphs'!$A$12)/('Other Graphs'!$A$15*SQRT('Other Graphs'!$A$12))","v":3.5940054257054226},{"$f":"F326-'Other Graphs'!$A$15*SQRT('Other Graphs'!$A$12)","v":3.2475952641916472},0.99983718347476536,0.9994180765211349,100.08923328944653,null,null,0.39500000000000024,{"$f":"IF($C$4, 'Other Graphs'!$A$6*Q326-EXP(-1*'Other Graphs'!$A$12*'Other Graphs'!$A$3)*'Other Graphs'!$A$9*R326,-1*'Other Graphs'!$A$6*Q326+EXP(-1*'Other Graphs'!$A$12*'Other Graphs'!$A$3)*'Other Graphs'!$A$9*R326)","v":33.7784421167677},{"$f":"(LN('Other Graphs'!$A$6/'Other Graphs'!$A$9)+('Other Graphs'!$A$3+0.5*M326^2)*'Other Graphs'!$A$12)/(M326*SQRT('Other Graphs'!$A$12))","v":0.495552890861716},{"$f":"O326-M326*SQRT('Other Graphs'!$A$12)","v":-0.18860717812799094},0.68989505154086306,0.4252003532294244,67.186018301521187]
[null,null,null,0.40000000000000024,{"$f":"IF($C$4, 'Other Graphs'!$A$6*H327-EXP(-1*'Other Graphs'!$A$12*D327)*'Other Graphs'!$A$9*I327,-1*'Other Graphs'!$A$6*H327+EXP(-1*'Other Graphs'!$A$12*D327)*'Other Graphs'!$A$9*I327)","v":76.87002790065975},{"$f":"(LN('Other Graphs'!$A$6/'Other Graphs'!$A$9)+(D327+0.5*'Other Graphs'!$A$15^2)*'Other Graphs'!$A$12)/('Other Graphs'!$A$15*SQRT('Other Graphs'!$A$12))","v":3.6373066958946443},{"$f":"F327-'Other Graphs'!$A$15*SQRT('Other Graphs'!$A$12)","v":3.2908965343808689},0.99986224809428281,0.99950065681040989,98.606694260519049,null,null,0.40000000000000024,{"$f":"IF($C$4, 'Other Graphs'!$A$6*Q327-EXP(-1*'Other Graphs'!$A$12*'Other Graphs'!$A$3)*'Other Graphs'!$A$9*R327,-1*'Other Graphs'!$A$6*Q327+EXP(-1*'Other Graphs'!$A$12*'Other Graphs'!$A$3)*'Other Graphs'!$A$9*R327)","v":34.114372208275306},{"$f":"(LN('Other Graphs'!$A$6/'Other Graphs'!$A$9)+('Other Graphs'!$A$3+0.5*M327^2)*'Other Graphs'!$A$12)/(M327*SQRT('Other Graphs'!$A$12))","v":0.4979646071760524},{"$f":"O327-M327*SQRT('Other Graphs'!$A$12)","v":-0.19485571585149886},0.69074550576962457,0.42275295161061122,67.104581619649593]
[null,null,null,0.40500000000000025,{"$f":"IF($C$4, 'Other Graphs'!$A$6*H328-EXP(-1*'Other Graphs'!$A$12*D328)*'Other Graphs'!$A$9*I328,-1*'Other Graphs'!$A$6*H328+EXP(-1*'Other Graphs'!$A$12*D328)*'Other Graphs'!$A$9*I328)","v":77.363061371962345},{"$f":"(LN('Other Graphs'!$A$6/'Other Graphs'!$A$9)+(D328+0.5*'Other Graphs'!$A$15^2)*'Other Graphs'!$A$12)/('Other Graphs'!$A$15*SQRT('Other Graphs'!$A$12))","v":3.6806079660838664},{"$f":"F328-'Other Graphs'!$A$15*SQRT('Other Graphs'!$A$12)","v":3.3341978045700911},0.99988366074427348,0.99957227100337709,97.145114743918185,null,null,0.40500000000000025,{"$f":"IF($C$4, 'Other Graphs'!$A$6*Q328-EXP(-1*'Other Graphs'!$A$12*'Other Graphs'!$A$3)*'Other Graphs'!$A$9*R328,-1*'Other Graphs'!$A$6*Q328+EXP(-1*'Other Graphs'!$A$12*'Other Graphs'!$A$3)*'Other Graphs'!$A$9*R328)","v":34.449895116373554},{"$f":"(LN('Other Graphs'!$A$6/'Other Graphs'!$A$9)+('Other Graphs'!$A$3+0.5*M328^2)*'Other Graphs'!$A$12)/(M328*SQRT('Other Graphs'!$A$12))","v":0.50042369165593414},{"$f":"O328-M328*SQRT('Other Graphs'!$A$12)","v":-0.20105688540946154},0.69161161261174209,0.4203270469967425,67.021282869597997]
[null,null,null,0.41000000000000025,{"$f":"IF($C$4, 'Other Graphs'!$A$6*H329-EXP(-1*'Other Graphs'!$A$12*D329)*'Other Graphs'!$A$9*I329,-1*'Other Graphs'!$A$6*H329+EXP(-1*'Other Graphs'!$A$12*D329)*'Other Graphs'!$A$9*I329)","v":77.848786945681937},{"$f":"(LN('Other Graphs'!$A$6/'Other Graphs'!$A$9)+(D329+0.5*'Other Graphs'!$A$15^2)*'Other Graphs'!$A$12)/('Other Graphs'!$A$15*SQRT('Other Graphs'!$A$12))","v":3.723909236273089},{"$f":"F329-'Other Graphs'!$A$15*SQRT('Other Graphs'!$A$12)","v":3.3774990747593137},0.99990191926314675,0.99963425900409286,95.704335311427172,null,null,0.41000000000000025,{"$f":"IF($C$4, 'Other Graphs'!$A$6*Q329-EXP(-1*'Other Graphs'!$A$12*'Other Graphs'!$A$3)*'Other Graphs'!$A$9*R329,-1*'Other Graphs'!$A$6*Q329+EXP(-1*'Other Graphs'!$A$12*'Other Graphs'!$A$3)*'Other Graphs'!$A$9*R329)","v":34.785001530721544},{"$f":"(LN('Other Graphs'!$A$6/'Other Graphs'!$A$9)+('Other Graphs'!$A$3+0.5*M329^2)*'Other Graphs'!$A$12)/(M329*SQRT('Other Graphs'!$A$12))","v":0.5029284113196949},{"$f":"O329-M329*SQRT('Other Graphs'!$A$12)","v":-0.20721241978354521},0.69249269746626974,0.41792198411133952,66.936163123081315]
[null,null,null,0.41500000000000026,{"$f":"IF($C$4, 'Other Graphs'!$A$6*H330-EXP(-1*'Other Graphs'!$A$12*D330)*'Other Graphs'!$A$9*I330,-1*'Other Graphs'!$A$6*H330+EXP(-1*'Other Graphs'!$A$12*D330)*'Other Graphs'!$A$9*I330)","v":78.327308622239073},{"$f":"(LN('Other Graphs'!$A$6/'Other Graphs'!$A$9)+(D330+0.5*'Other Graphs'!$A$15^2)*'Other Graphs'!$A$12)/('Other Graphs'!$A$15*SQRT('Other Graphs'!$A$12))","v":3.7672105064623103},{"$f":"F330-'Other Graphs'!$A$15*SQRT('Other Graphs'!$A$12)","v":3.4208003449485349},0.99991745910147845,0.99968781424553277,94.284179637696667,null,null,0.41500000000000026,{"$f":"IF($C$4, 'Other Graphs'!$A$6*Q330-EXP(-1*'Other Graphs'!$A$12*'Other Graphs'!$A$3)*'Other Graphs'!$A$9*R330,-1*'Other Graphs'!$A$6*Q330+EXP(-1*'Other Graphs'!$A$12*'Other Graphs'!$A$3)*'Other Graphs'!$A$9*R330)","v":35.119682346336951},{"$f":"(LN('Other Graphs'!$A$6/'Other Graphs'!$A$9)+('Other Graphs'!$A$3+0.5*M330^2)*'Other Graphs'!$A$12)/(M330*SQRT('Other Graphs'!$A$12))","v":0.50547711670285722},{"$f":"O330-M330*SQRT('Other Graphs'!$A$12)","v":-0.21332396843822721},0.69338811655807642,0.41553713984290119,66.849261414823445]
[null,null,null,0.42000000000000026,{"$f":"IF($C$4, 'Other Graphs'!$A$6*H331-EXP(-1*'Other Graphs'!$A$12*D331)*'Other Graphs'!$A$9*I331,-1*'Other Graphs'!$A$6*H331+EXP(-1*'Other Graphs'!$A$12*D331)*'Other Graphs'!$A$9*I331)","v":78.798729520427557},{"$f":"(LN('Other Graphs'!$A$6/'Other Graphs'!$A$9)+(D331+0.5*'Other Graphs'!$A$15^2)*'Other Graphs'!$A$12)/('Other Graphs'!$A$15*SQRT('Other Graphs'!$A$12))","v":3.810511776651532},{"$f":"F331-'Other Graphs'!$A$15*SQRT('Other Graphs'!$A$12)","v":3.4641016151377566},0.99993066029728528,0.99973399724743039,92.884456927811158,null,null,0.42000000000000026,{"$f":"IF($C$4, 'Other Graphs'!$A$6*Q331-EXP(-1*'Other Graphs'!$A$12*'Other Graphs'!$A$3)*'Other Graphs'!$A$9*R331,-1*'Other Graphs'!$A$6*Q331+EXP(-1*'Other Graphs'!$A$12*'Other Graphs'!$A$3)*'Other Graphs'!$A$9*R331)","v":35.453928653411069},{"$f":"(LN('Other Graphs'!$A$6/'Other Graphs'!$A$9)+('Other Graphs'!$A$3+0.5*M331^2)*'Other Graphs'!$A$12)/(M331*SQRT('Other Graphs'!$A$12))","v":0.50806823688687086},{"$f":"O331-M331*SQRT('Other Graphs'!$A$12)","v":-0.219393102292058},0.6942972551515213,0.41317192136365671,66.760614887749568]
[null,null,null,0.42500000000000027,{"$f":"IF($C$4, 'Other Graphs'!$A$6*H332-EXP(-1*'Other Graphs'!$A$12*D332)*'Other Graphs'!$A$9*I332,-1*'Other Graphs'!$A$6*H332+EXP(-1*'Other Graphs'!$A$12*D332)*'Other Graphs'!$A$9*I332)","v":79.263151805066613},{"$f":"(LN('Other Graphs'!$A$6/'Other Graphs'!$A$9)+(D332+0.5*'Other Graphs'!$A$15^2)*'Other Graphs'!$A$12)/('Other Graphs'!$A$15*SQRT('Other Graphs'!$A$12))","v":3.8538130468407545},{"$f":"F332-'Other Graphs'!$A$15*SQRT('Other Graphs'!$A$12)","v":3.5074028853269792},0.99994185379652611,0.99977374825678489,91.504964101326806,null,null,0.42500000000000027,{"$f":"IF($C$4, 'Other Graphs'!$A$6*Q332-EXP(-1*'Other Graphs'!$A$12*'Other Graphs'!$A$3)*'Other Graphs'!$A$9*R332,-1*'Other Graphs'!$A$6*Q332+EXP(-1*'Other Graphs'!$A$12*'Other Graphs'!$A$3)*'Other Graphs'!$A$9*R332)","v":35.787731727849817},{"$f":"(LN('Other Graphs'!$A$6/'Other Graphs'!$A$9)+('Other Graphs'!$A$3+0.5*M332^2)*'Other Graphs'!$A$12)/(M332*SQRT('Other Graphs'!$A$12))","v":0.51070027487876468},{"$f":"O332-M332*SQRT('Other Graphs'!$A$12)","v":-0.2254213183380086},0.69521952588711144,0.41082576437758389,66.670258926615077]
[null,null,null,0.43000000000000027,{"$f":"IF($C$4, 'Other Graphs'!$A$6*H333-EXP(-1*'Other Graphs'!$A$12*D333)*'Other Graphs'!$A$9*I333,-1*'Other Graphs'!$A$6*H333+EXP(-1*'Other Graphs'!$A$12*D333)*'Other Graphs'!$A$9*I333)","v":79.720676625573248},{"$f":"(LN('Other Graphs'!$A$6/'Other Graphs'!$A$9)+(D333+0.5*'Other Graphs'!$A$15^2)*'Other Graphs'!$A$12)/('Other Graphs'!$A$15*SQRT('Other Graphs'!$A$12))","v":3.8971143170299767},{"$f":"F333-'Other Graphs'!$A$15*SQRT('Other Graphs'!$A$12)","v":3.5507041555162013},0.99995132716217638,0.99980789898648248,90.145487750675017,null,null,0.43000000000000027,{"$f":"IF($C$4, 'Other Graphs'!$A$6*Q333-EXP(-1*'Other Graphs'!$A$12*'Other Graphs'!$A$3)*'Other Graphs'!$A$9*R333,-1*'Other Graphs'!$A$6*Q333+EXP(-1*'Other Graphs'!$A$12*'Other Graphs'!$A$3)*'Other Graphs'!$A$9*R333)","v":36.121083022482892},{"$f":"(LN('Other Graphs'!$A$6/'Other Graphs'!$A$9)+('Other Graphs'!$A$3+0.5*M333^2)*'Other Graphs'!$A$12)/(M333*SQRT('Other Graphs'!$A$12))","v":0.51337180331314758},{"$f":"O333-M333*SQRT('Other Graphs'!$A$12)","v":-0.23141004394147013},0.69615436723142199,0.4084981314874836,66.578227280869783]
[null,null,null,0.43500000000000028,{"$f":"IF($C$4, 'Other Graphs'!$A$6*H334-EXP(-1*'Other Graphs'!$A$12*D334)*'Other Graphs'!$A$9*I334,-1*'Other Graphs'!$A$6*H334+EXP(-1*'Other Graphs'!$A$12*D334)*'Other Graphs'!$A$9*I334)","v":80.171404064326623},{"$f":"(LN('Other Graphs'!$A$6/'Other Graphs'!$A$9)+(D334+0.5*'Other Graphs'!$A$15^2)*'Other Graphs'!$A$12)/('Other Graphs'!$A$15*SQRT('Other Graphs'!$A$12))","v":3.9404155872191984},{"$f":"F334-'Other Graphs'!$A$15*SQRT('Other Graphs'!$A$12)","v":3.594005425705423},0.99995932971503743,0.99983718347476536,88.805805891246251,null,null,0.43500000000000028,{"$f":"IF($C$4, 'Other Graphs'!$A$6*Q334-EXP(-1*'Other Graphs'!$A$12*'Other Graphs'!$A$3)*'Other Graphs'!$A$9*R334,-1*'Other Graphs'!$A$6*Q334+EXP(-1*'Other Graphs'!$A$12*'Other Graphs'!$A$3)*'Other Graphs'!$A$9*R334)","v":36.453974158887242},{"$f":"(LN('Other Graphs'!$A$6/'Other Graphs'!$A$9)+('Other Graphs'!$A$3+0.5*M334^2)*'Other Graphs'!$A$12)/(M334*SQRT('Other Graphs'!$A$12))","v":0.51608146045062353},{"$f":"O334-M334*SQRT('Other Graphs'!$A$12)","v":-0.2373606408418385},0.69710124203141666,0.40618851067180989,66.484552177907062]
[null,null,null,0.44000000000000028,{"$f":"IF($C$4, 'Other Graphs'!$A$6*H335-EXP(-1*'Other Graphs'!$A$12*D335)*'Other Graphs'!$A$9*I335,-1*'Other Graphs'!$A$6*H335+EXP(-1*'Other Graphs'!$A$12*D335)*'Other Graphs'!$A$9*I335)","v":80.615433093782855},{"$f":"(LN('Other Graphs'!$A$6/'Other Graphs'!$A$9)+(D335+0.5*'Other Graphs'!$A$15^2)*'Other Graphs'!$A$12)/('Other Graphs'!$A$15*SQRT('Other Graphs'!$A$12))","v":3.9837168574084201},{"$f":"F335-'Other Graphs'!$A$15*SQRT('Other Graphs'!$A$12)","v":3.6373066958946447},0.99996607714876418,0.99986224809428281,87.485689520008165,null,null,0.44000000000000028,{"$f":"IF($C$4, 'Other Graphs'!$A$6*Q335-EXP(-1*'Other Graphs'!$A$12*'Other Graphs'!$A$3)*'Other Graphs'!$A$9*R335,-1*'Other Graphs'!$A$6*Q335+EXP(-1*'Other Graphs'!$A$12*'Other Graphs'!$A$3)*'Other Graphs'!$A$9*R335)","v":36.786396919776777},{"$f":"(LN('Other Graphs'!$A$6/'Other Graphs'!$A$9)+('Other Graphs'!$A$3+0.5*M335^2)*'Other Graphs'!$A$12)/(M335*SQRT('Other Graphs'!$A$12))","v":0.51882794644904118},{"$f":"O335-M335*SQRT('Other Graphs'!$A$12)","v":-0.24327440888126528},0.69805963616509403,0.4038964138627722,66.389264427468163]
[null,null,null,0.44500000000000028,{"$f":"IF($C$4, 'Other Graphs'!$A$6*H336-EXP(-1*'Other Graphs'!$A$12*D336)*'Other Graphs'!$A$9*I336,-1*'Other Graphs'!$A$6*H336+EXP(-1*'Other Graphs'!$A$12*D336)*'Other Graphs'!$A$9*I336)","v":81.052861541382896},{"$f":"(LN('Other Graphs'!$A$6/'Other Graphs'!$A$9)+(D336+0.5*'Other Graphs'!$A$15^2)*'Other Graphs'!$A$12)/('Other Graphs'!$A$15*SQRT('Other Graphs'!$A$12))","v":4.0270181275976427},{"$f":"F336-'Other Graphs'!$A$15*SQRT('Other Graphs'!$A$12)","v":3.6806079660838673},0.99997175566051122,0.99988366074427348,86.18490399896352,null,null,0.44500000000000028,{"$f":"IF($C$4, 'Other Graphs'!$A$6*Q336-EXP(-1*'Other Graphs'!$A$12*'Other Graphs'!$A$3)*'Other Graphs'!$A$9*R336,-1*'Other Graphs'!$A$6*Q336+EXP(-1*'Other Graphs'!$A$12*'Other Graphs'!$A$3)*'Other Graphs'!$A$9*R336)","v":37.118343241914118},{"$f":"(LN('Other Graphs'!$A$6/'Other Graphs'!$A$9)+('Other Graphs'!$A$3+0.5*M336^2)*'Other Graphs'!$A$12)/(M336*SQRT('Other Graphs'!$A$12))","v":0.52161001988612199},{"$f":"O336-M336*SQRT('Other Graphs'!$A$12)","v":-0.2491525894820289},0.69902905728108555,0.40162137561796601,66.292393517946323]
[null,null,null,0.45000000000000029,{"$f":"IF($C$4, 'Other Graphs'!$A$6*H337-EXP(-1*'Other Graphs'!$A$12*D337)*'Other Graphs'!$A$9*I337,-1*'Other Graphs'!$A$6*H337+EXP(-1*'Other Graphs'!$A$12*D337)*'Other Graphs'!$A$9*I337)","v":81.483786061377714},{"$f":"(LN('Other Graphs'!$A$6/'Other Graphs'!$A$9)+(D337+0.5*'Other Graphs'!$A$15^2)*'Other Graphs'!$A$12)/('Other Graphs'!$A$15*SQRT('Other Graphs'!$A$12))","v":4.0703193977868644},{"$f":"F337-'Other Graphs'!$A$15*SQRT('Other Graphs'!$A$12)","v":3.723909236273089},0.99997652563717521,0.99990191926314675,84.903210278673598,null,null,0.45000000000000029,{"$f":"IF($C$4, 'Other Graphs'!$A$6*Q337-EXP(-1*'Other Graphs'!$A$12*'Other Graphs'!$A$3)*'Other Graphs'!$A$9*R337,-1*'Other Graphs'!$A$6*Q337+EXP(-1*'Other Graphs'!$A$12*'Other Graphs'!$A$3)*'Other Graphs'!$A$9*R337)","v":37.44980520950385},{"$f":"(LN('Other Graphs'!$A$6/'Other Graphs'!$A$9)+('Other Graphs'!$A$3+0.5*M337^2)*'Other Graphs'!$A$12)/(M337*SQRT('Other Graphs'!$A$12))","v":0.52442649451391032},{"$f":"O337-M337*SQRT('Other Graphs'!$A$12)","v":-0.25499636889208488},0.7000090336204623,0.39936295187845205,66.193967705397881]
[null,null,null,0.45500000000000029,{"$f":"IF($C$4, 'Other Graphs'!$A$6*H338-EXP(-1*'Other Graphs'!$A$12*D338)*'Other Graphs'!$A$9*I338,-1*'Other Graphs'!$A$6*H338+EXP(-1*'Other Graphs'!$A$12*D338)*'Other Graphs'!$A$9*I338)","v":81.908302112771082},{"$f":"(LN('Other Graphs'!$A$6/'Other Graphs'!$A$9)+(D338+0.5*'Other Graphs'!$A$15^2)*'Other Graphs'!$A$12)/('Other Graphs'!$A$15*SQRT('Other Graphs'!$A$12))","v":4.1136206679760861},{"$f":"F338-'Other Graphs'!$A$15*SQRT('Other Graphs'!$A$12)","v":3.7672105064623107},0.99998052493553524,0.99991745910147845,83.6403659766858,null,null,0.45500000000000029,{"$f":"IF($C$4, 'Other Graphs'!$A$6*Q338-EXP(-1*'Other Graphs'!$A$12*'Other Graphs'!$A$3)*'Other Graphs'!$A$9*R338,-1*'Other Graphs'!$A$6*Q338+EXP(-1*'Other Graphs'!$A$12*'Other Graphs'!$A$3)*'Other Graphs'!$A$9*R338)","v":37.78077504803084},{"$f":"(LN('Other Graphs'!$A$6/'Other Graphs'!$A$9)+('Other Graphs'!$A$3+0.5*M338^2)*'Other Graphs'!$A$12)/(M338*SQRT('Other Graphs'!$A$12))","v":0.52727623622721809},{"$f":"O338-M338*SQRT('Other Graphs'!$A$12)","v":-0.26080688121662154},0.70099911291459249,0.39712071880681199,66.094014095737862]
[null,null,null,0.4600000000000003,{"$f":"IF($C$4, 'Other Graphs'!$A$6*H339-EXP(-1*'Other Graphs'!$A$12*D339)*'Other Graphs'!$A$9*I339,-1*'Other Graphs'!$A$6*H339+EXP(-1*'Other Graphs'!$A$12*D339)*'Other Graphs'!$A$9*I339)","v":82.326503942654512},{"$f":"(LN('Other Graphs'!$A$6/'Other Graphs'!$A$9)+(D339+0.5*'Other Graphs'!$A$15^2)*'Other Graphs'!$A$12)/('Other Graphs'!$A$15*SQRT('Other Graphs'!$A$12))","v":4.1569219381653078},{"$f":"F339-'Other Graphs'!$A$15*SQRT('Other Graphs'!$A$12)","v":3.8105117766515324},0.99998387179271875,0.99993066029728528,82.396126324482495,null,null,0.4600000000000003,{"$f":"IF($C$4, 'Other Graphs'!$A$6*Q339-EXP(-1*'Other Graphs'!$A$12*'Other Graphs'!$A$3)*'Other Graphs'!$A$9*R339,-1*'Other Graphs'!$A$6*Q339+EXP(-1*'Other Graphs'!$A$12*'Other Graphs'!$A$3)*'Other Graphs'!$A$9*R339)","v":38.11124511850953},{"$f":"(LN('Other Graphs'!$A$6/'Other Graphs'!$A$9)+('Other Graphs'!$A$3+0.5*M339^2)*'Other Graphs'!$A$12)/(M339*SQRT('Other Graphs'!$A$12))","v":0.53015816022977835},{"$f":"O339-M339*SQRT('Other Graphs'!$A$12)","v":-0.26658521125190571},0.70199886135340217,0.3948942716992509,65.992558720893101]
[null,null,null,0.4650000000000003,{"$f":"IF($C$4, 'Other Graphs'!$A$6*H340-EXP(-1*'Other Graphs'!$A$12*D340)*'Other Graphs'!$A$9*I340,-1*'Other Graphs'!$A$6*H340+EXP(-1*'Other Graphs'!$A$12*D340)*'Other Graphs'!$A$9*I340)","v":82.738484574276924},{"$f":"(LN('Other Graphs'!$A$6/'Other Graphs'!$A$9)+(D340+0.5*'Other Graphs'!$A$15^2)*'Other Graphs'!$A$12)/('Other Graphs'!$A$15*SQRT('Other Graphs'!$A$12))","v":4.2002232083545303},{"$f":"F340-'Other Graphs'!$A$15*SQRT('Other Graphs'!$A$12)","v":3.853813046840755},0.99998666740140407,0.99994185379652611,81.170244995865843,null,null,0.4650000000000003,{"$f":"IF($C$4, 'Other Graphs'!$A$6*Q340-EXP(-1*'Other Graphs'!$A$12*'Other Graphs'!$A$3)*'Other Graphs'!$A$9*R340,-1*'Other Graphs'!$A$6*Q340+EXP(-1*'Other Graphs'!$A$12*'Other Graphs'!$A$3)*'Other Graphs'!$A$9*R340)","v":38.441207912113995},{"$f":"(LN('Other Graphs'!$A$6/'Other Graphs'!$A$9)+('Other Graphs'!$A$3+0.5*M340^2)*'Other Graphs'!$A$12)/(M340*SQRT('Other Graphs'!$A$12))","v":0.53307122838322807},{"$f":"O340-M340*SQRT('Other Graphs'!$A$12)","v":-0.27233239713630031},0.70300786261887172,0.392683223966315,65.889626609151662]
[null,null,null,0.47000000000000031,{"$f":"IF($C$4, 'Other Graphs'!$A$6*H341-EXP(-1*'Other Graphs'!$A$12*D341)*'Other Graphs'!$A$9*I341,-1*'Other Graphs'!$A$6*H341+EXP(-1*'Other Graphs'!$A$12*D341)*'Other Graphs'!$A$9*I341)","v":83.144335799256254},{"$f":"(LN('Other Graphs'!$A$6/'Other Graphs'!$A$9)+(D341+0.5*'Other Graphs'!$A$15^2)*'Other Graphs'!$A$12)/('Other Graphs'!$A$15*SQRT('Other Graphs'!$A$12))","v":4.243524478543752},{"$f":"F341-'Other Graphs'!$A$15*SQRT('Other Graphs'!$A$12)","v":3.8971143170299767},0.99998899818206699,0.99995132716217638,79.962474828829428,null,null,0.47000000000000031,{"$f":"IF($C$4, 'Other Graphs'!$A$6*Q341-EXP(-1*'Other Graphs'!$A$12*'Other Graphs'!$A$3)*'Other Graphs'!$A$9*R341,-1*'Other Graphs'!$A$6*Q341+EXP(-1*'Other Graphs'!$A$12*'Other Graphs'!$A$3)*'Other Graphs'!$A$9*R341)","v":38.770656045159754},{"$f":"(LN('Other Graphs'!$A$6/'Other Graphs'!$A$9)+('Other Graphs'!$A$3+0.5*M341^2)*'Other Graphs'!$A$12)/(M341*SQRT('Other Graphs'!$A$12))","v":0.53601444672530485},{"$f":"O341-M341*SQRT('Other Graphs'!$A$12)","v":-0.27804943283206796},0.70402571697902061,0.39048720617724009,65.785241850517139]
[null,null,null,0.47500000000000031,{"$f":"IF($C$4, 'Other Graphs'!$A$6*H342-EXP(-1*'Other Graphs'!$A$12*D342)*'Other Graphs'!$A$9*I342,-1*'Other Graphs'!$A$6*H342+EXP(-1*'Other Graphs'!$A$12*D342)*'Other Graphs'!$A$9*I342)","v":83.544148173400401},{"$f":"(LN('Other Graphs'!$A$6/'Other Graphs'!$A$9)+(D342+0.5*'Other Graphs'!$A$15^2)*'Other Graphs'!$A$12)/('Other Graphs'!$A$15*SQRT('Other Graphs'!$A$12))","v":4.2868257487329737},{"$f":"F342-'Other Graphs'!$A$15*SQRT('Other Graphs'!$A$12)","v":3.9404155872191984},0.99999093778242909,0.99995932971503743,78.772568451978415,null,null,0.47500000000000031,{"$f":"IF($C$4, 'Other Graphs'!$A$6*Q342-EXP(-1*'Other Graphs'!$A$12*'Other Graphs'!$A$3)*'Other Graphs'!$A$9*R342,-1*'Other Graphs'!$A$6*Q342+EXP(-1*'Other Graphs'!$A$12*'Other Graphs'!$A$3)*'Other Graphs'!$A$9*R342)","v":39.09958225441234},{"$f":"(LN('Other Graphs'!$A$6/'Other Graphs'!$A$9)+('Other Graphs'!$A$3+0.5*M342^2)*'Other Graphs'!$A$12)/(M342*SQRT('Other Graphs'!$A$12))","v":0.53898686314478905},{"$f":"O342-M342*SQRT('Other Graphs'!$A$12)","v":-0.28373727045042818},0.70505204043803038,0.38830586516335613,65.679427657177257]
[null,null,null,0.48000000000000032,{"$f":"IF($C$4, 'Other Graphs'!$A$6*H343-EXP(-1*'Other Graphs'!$A$12*D343)*'Other Graphs'!$A$9*I343,-1*'Other Graphs'!$A$6*H343+EXP(-1*'Other Graphs'!$A$12*D343)*'Other Graphs'!$A$9*I343)","v":83.938011015660294},{"$f":"(LN('Other Graphs'!$A$6/'Other Graphs'!$A$9)+(D343+0.5*'Other Graphs'!$A$15^2)*'Other Graphs'!$A$12)/('Other Graphs'!$A$15*SQRT('Other Graphs'!$A$12))","v":4.3301270189221954},{"$f":"F343-'Other Graphs'!$A$15*SQRT('Other Graphs'!$A$12)","v":3.9837168574084201},0.99999254883210376,0.99996607714876418,77.600278825727216,null,null,0.48000000000000032,{"$f":"IF($C$4, 'Other Graphs'!$A$6*Q343-EXP(-1*'Other Graphs'!$A$12*'Other Graphs'!$A$3)*'Other Graphs'!$A$9*R343,-1*'Other Graphs'!$A$6*Q343+EXP(-1*'Other Graphs'!$A$12*'Other Graphs'!$A$3)*'Other Graphs'!$A$9*R343)","v":39.427979392698226},{"$f":"(LN('Other Graphs'!$A$6/'Other Graphs'!$A$9)+('Other Graphs'!$A$3+0.5*M343^2)*'Other Graphs'!$A$12)/(M343*SQRT('Other Graphs'!$A$12))","v":0.5419875652017615},{"$f":"O343-M343*SQRT('Other Graphs'!$A$12)","v":-0.28939682243130005},0.70608646393850139,0.38613886317634349,65.572206419656652]
[null,null,null,0.48500000000000032,{"$f":"IF($C$4, 'Other Graphs'!$A$6*H344-EXP(-1*'Other Graphs'!$A$12*D344)*'Other Graphs'!$A$9*I344,-1*'Other Graphs'!$A$6*H344+EXP(-1*'Other Graphs'!$A$12*D344)*'Other Graphs'!$A$9*I344)","v":84.32601240978893},{"$f":"(LN('Other Graphs'!$A$6/'Other Graphs'!$A$9)+(D344+0.5*'Other Graphs'!$A$15^2)*'Other Graphs'!$A$12)/('Other Graphs'!$A$15*SQRT('Other Graphs'!$A$12))","v":4.373428289111418},{"$f":"F344-'Other Graphs'!$A$15*SQRT('Other Graphs'!$A$12)","v":4.0270181275976427},0.99999388447829929,0.99997175566051122,76.445359707670875,null,null,0.48500000000000032,{"$f":"IF($C$4, 'Other Graphs'!$A$6*Q344-EXP(-1*'Other Graphs'!$A$12*'Other Graphs'!$A$3)*'Other Graphs'!$A$9*R344,-1*'Other Graphs'!$A$6*Q344+EXP(-1*'Other Graphs'!$A$12*'Other Graphs'!$A$3)*'Other Graphs'!$A$9*R344)","v":39.75584042479651},{"$f":"(LN('Other Graphs'!$A$6/'Other Graphs'!$A$9)+('Other Graphs'!$A$3+0.5*M344^2)*'Other Graphs'!$A$12)/(M344*SQRT('Other Graphs'!$A$12))","v":0.54501567808269158},{"$f":"O344-M344*SQRT('Other Graphs'!$A$12)","v":-0.2950289635882144},0.7071286326121653,0.38398587709747378,65.463599759009071]
[null,null,null,0.49000000000000032,{"$f":"IF($C$4, 'Other Graphs'!$A$6*H345-EXP(-1*'Other Graphs'!$A$12*D345)*'Other Graphs'!$A$9*I345,-1*'Other Graphs'!$A$6*H345+EXP(-1*'Other Graphs'!$A$12*D345)*'Other Graphs'!$A$9*I345)","v":84.708239208327285},{"$f":"(LN('Other Graphs'!$A$6/'Other Graphs'!$A$9)+(D345+0.5*'Other Graphs'!$A$15^2)*'Other Graphs'!$A$12)/('Other Graphs'!$A$15*SQRT('Other Graphs'!$A$12))","v":4.4167295593006406},{"$f":"F345-'Other Graphs'!$A$15*SQRT('Other Graphs'!$A$12)","v":4.0703193977868652},0.99999498972634615,0.99997652563717521,75.307566050810166,null,null,0.49000000000000032,{"$f":"IF($C$4, 'Other Graphs'!$A$6*Q345-EXP(-1*'Other Graphs'!$A$12*'Other Graphs'!$A$3)*'Other Graphs'!$A$9*R345,-1*'Other Graphs'!$A$6*Q345+EXP(-1*'Other Graphs'!$A$12*'Other Graphs'!$A$3)*'Other Graphs'!$A$9*R345)","v":40.083158423591556},{"$f":"(LN('Other Graphs'!$A$6/'Other Graphs'!$A$9)+('Other Graphs'!$A$3+0.5*M345^2)*'Other Graphs'!$A$12)/(M345*SQRT('Other Graphs'!$A$12))","v":0.54807036268072362},{"$f":"O345-M345*SQRT('Other Graphs'!$A$12)","v":-0.30063453302802678},0.70817820507566731,0.38184659769427676,65.353628575213861]
[null,null,null,0.49500000000000033,{"$f":"IF($C$4, 'Other Graphs'!$A$6*H346-EXP(-1*'Other Graphs'!$A$12*D346)*'Other Graphs'!$A$9*I346,-1*'Other Graphs'!$A$6*H346+EXP(-1*'Other Graphs'!$A$12*D346)*'Other Graphs'!$A$9*I346)","v":85.084777038581336},{"$f":"(LN('Other Graphs'!$A$6/'Other Graphs'!$A$9)+(D346+0.5*'Other Graphs'!$A$15^2)*'Other Graphs'!$A$12)/('Other Graphs'!$A$15*SQRT('Other Graphs'!$A$12))","v":4.4600308294898623},{"$f":"F346-'Other Graphs'!$A$15*SQRT('Other Graphs'!$A$12)","v":4.1136206679760869},0.99999590260679461,0.99998052493553524,74.186654342213316,null,null,0.49500000000000033,{"$f":"IF($C$4, 'Other Graphs'!$A$6*Q346-EXP(-1*'Other Graphs'!$A$12*'Other Graphs'!$A$3)*'Other Graphs'!$A$9*R346,-1*'Other Graphs'!$A$6*Q346+EXP(-1*'Other Graphs'!$A$12*'Other Graphs'!$A$3)*'Other Graphs'!$A$9*R346)","v":40.409926566467625},{"$f":"(LN('Other Graphs'!$A$6/'Other Graphs'!$A$9)+('Other Graphs'!$A$3+0.5*M346^2)*'Other Graphs'!$A$12)/(M346*SQRT('Other Graphs'!$A$12))","v":0.5511508137923089},{"$f":"O346-M346*SQRT('Other Graphs'!$A$12)","v":-0.30621433595428593},0.7092348527682959,0.37972072892135378,65.242313092269853]
[null,null,null,0.50000000000000033,{"$f":"IF($C$4, 'Other Graphs'!$A$6*H347-EXP(-1*'Other Graphs'!$A$12*D347)*'Other Graphs'!$A$9*I347,-1*'Other Graphs'!$A$6*H347+EXP(-1*'Other Graphs'!$A$12*D347)*'Other Graphs'!$A$9*I347)","v":85.455710310292403},{"$f":"(LN('Other Graphs'!$A$6/'Other Graphs'!$A$9)+(D347+0.5*'Other Graphs'!$A$15^2)*'Other Graphs'!$A$12)/('Other Graphs'!$A$15*SQRT('Other Graphs'!$A$12))","v":4.503332099679084},{"$f":"F347-'Other Graphs'!$A$15*SQRT('Other Graphs'!$A$12)","v":4.1569219381653086},0.99999665518888692,0.99998387179271875,73.082382889444304,null,null,0.50000000000000033,{"$f":"IF($C$4, 'Other Graphs'!$A$6*Q347-EXP(-1*'Other Graphs'!$A$12*'Other Graphs'!$A$3)*'Other Graphs'!$A$9*R347,-1*'Other Graphs'!$A$6*Q347+EXP(-1*'Other Graphs'!$A$12*'Other Graphs'!$A$3)*'Other Graphs'!$A$9*R347)","v":40.736138131928975},{"$f":"(LN('Other Graphs'!$A$6/'Other Graphs'!$A$9)+('Other Graphs'!$A$3+0.5*M347^2)*'Other Graphs'!$A$12)/(M347*SQRT('Other Graphs'!$A$12))","v":0.55425625842204107},{"$f":"O347-M347*SQRT('Other Graphs'!$A$12)","v":-0.31176914536239808},0.71029825932878676,0.37760798726231581,65.12967290013728]
[null,null,null,0.50500000000000034,{"$f":"IF($C$4, 'Other Graphs'!$A$6*H348-EXP(-1*'Other Graphs'!$A$12*D348)*'Other Graphs'!$A$9*I348,-1*'Other Graphs'!$A$6*H348+EXP(-1*'Other Graphs'!$A$12*D348)*'Other Graphs'!$A$9*I348)","v":85.821122224739625},{"$f":"(LN('Other Graphs'!$A$6/'Other Graphs'!$A$9)+(D348+0.5*'Other Graphs'!$A$15^2)*'Other Graphs'!$A$12)/('Other Graphs'!$A$15*SQRT('Other Graphs'!$A$12))","v":4.5466333698683057},{"$f":"F348-'Other Graphs'!$A$15*SQRT('Other Graphs'!$A$12)","v":4.2002232083545303},0.9999972744583705,0.99998666740140407,71.994512060925274,null,null,0.50500000000000034,{"$f":"IF($C$4, 'Other Graphs'!$A$6*Q348-EXP(-1*'Other Graphs'!$A$12*'Other Graphs'!$A$3)*'Other Graphs'!$A$9*R348,-1*'Other Graphs'!$A$6*Q348+EXP(-1*'Other Graphs'!$A$12*'Other Graphs'!$A$3)*'Other Graphs'!$A$9*R348)","v":41.061786496429661},{"$f":"(LN('Other Graphs'!$A$6/'Other Graphs'!$A$9)+('Other Graphs'!$A$3+0.5*M348^2)*'Other Graphs'!$A$12)/(M348*SQRT('Other Graphs'!$A$12))","v":0.5573859541881927},{"$f":"O348-M348*SQRT('Other Graphs'!$A$12)","v":-0.31729970363409088},0.71136812000854588,0.37550810111005484,65.015726993701094]
[null,null,null,0.51000000000000034,{"$f":"IF($C$4, 'Other Graphs'!$A$6*H349-EXP(-1*'Other Graphs'!$A$12*D349)*'Other Graphs'!$A$9*I349,-1*'Other Graphs'!$A$6*H349+EXP(-1*'Other Graphs'!$A$12*D349)*'Other Graphs'!$A$9*I349)","v":86.181094785044252},{"$f":"(LN('Other Graphs'!$A$6/'Other Graphs'!$A$9)+(D349+0.5*'Other Graphs'!$A$15^2)*'Other Graphs'!$A$12)/('Other Graphs'!$A$15*SQRT('Other Graphs'!$A$12))","v":4.5899346400575283},{"$f":"F349-'Other Graphs'!$A$15*SQRT('Other Graphs'!$A$12)","v":4.2435244785437529},0.99999778307587583,0.99998899818206699,70.922804486048051,null,null,0.51000000000000034,{"$f":"IF($C$4, 'Other Graphs'!$A$6*Q349-EXP(-1*'Other Graphs'!$A$12*'Other Graphs'!$A$3)*'Other Graphs'!$A$9*R349,-1*'Other Graphs'!$A$6*Q349+EXP(-1*'Other Graphs'!$A$12*'Other Graphs'!$A$3)*'Other Graphs'!$A$9*R349)","v":41.386865131398167},{"$f":"(LN('Other Graphs'!$A$6/'Other Graphs'!$A$9)+('Other Graphs'!$A$3+0.5*M349^2)*'Other Graphs'!$A$12)/(M349*SQRT('Other Graphs'!$A$12))","v":0.5605391878220457},{"$f":"O349-M349*SQRT('Other Graphs'!$A$12)","v":-0.3228067240380823},0.71244414111884058,0.37342081018277629,64.900493809201919]
[null,null,null,0.51500000000000035,{"$f":"IF($C$4, 'Other Graphs'!$A$6*H350-EXP(-1*'Other Graphs'!$A$12*D350)*'Other Graphs'!$A$9*I350,-1*'Other Graphs'!$A$6*H350+EXP(-1*'Other Graphs'!$A$12*D350)*'Other Graphs'!$A$9*I350)","v":86.535708807474492},{"$f":"(LN('Other Graphs'!$A$6/'Other Graphs'!$A$9)+(D350+0.5*'Other Graphs'!$A$15^2)*'Other Graphs'!$A$12)/('Other Graphs'!$A$15*SQRT('Other Graphs'!$A$12))","v":4.63323591024675},{"$f":"F350-'Other Graphs'!$A$15*SQRT('Other Graphs'!$A$12)","v":4.2868257487329746},0.99999820003045925,0.99999093778242909,69.867025220207722,null,null,0.51500000000000035,{"$f":"IF($C$4, 'Other Graphs'!$A$6*Q350-EXP(-1*'Other Graphs'!$A$12*'Other Graphs'!$A$3)*'Other Graphs'!$A$9*R350,-1*'Other Graphs'!$A$6*Q350+EXP(-1*'Other Graphs'!$A$12*'Other Graphs'!$A$3)*'Other Graphs'!$A$9*R350)","v":41.711367600444177},{"$f":"(LN('Other Graphs'!$A$6/'Other Graphs'!$A$9)+('Other Graphs'!$A$3+0.5*M350^2)*'Other Graphs'!$A$12)/(M350*SQRT('Other Graphs'!$A$12))","v":0.56371527375463815},{"$f":"O350-M350*SQRT('Other Graphs'!$A$12)","v":-0.32829089214333418},0.71352603950969695,0.37134586497340866,64.783991258137462]
[null,null,null,0.52000000000000035,{"$f":"IF($C$4, 'Other Graphs'!$A$6*H351-EXP(-1*'Other Graphs'!$A$12*D351)*'Other Graphs'!$A$9*I351,-1*'Other Graphs'!$A$6*H351+EXP(-1*'Other Graphs'!$A$12*D351)*'Other Graphs'!$A$9*I351)","v":86.885043933575531},{"$f":"(LN('Other Graphs'!$A$6/'Other Graphs'!$A$9)+(D351+0.5*'Other Graphs'!$A$15^2)*'Other Graphs'!$A$12)/('Other Graphs'!$A$15*SQRT('Other Graphs'!$A$12))","v":4.6765371804359717},{"$f":"F351-'Other Graphs'!$A$15*SQRT('Other Graphs'!$A$12)","v":4.3301270189221963},0.99999854120139453,0.99999254883210376,68.826941879206004,null,null,0.52000000000000035,{"$f":"IF($C$4, 'Other Graphs'!$A$6*Q351-EXP(-1*'Other Graphs'!$A$12*'Other Graphs'!$A$3)*'Other Graphs'!$A$9*R351,-1*'Other Graphs'!$A$6*Q351+EXP(-1*'Other Graphs'!$A$12*'Other Graphs'!$A$3)*'Other Graphs'!$A$9*R351)","v":42.035287556734865},{"$f":"(LN('Other Graphs'!$A$6/'Other Graphs'!$A$9)+('Other Graphs'!$A$3+0.5*M351^2)*'Other Graphs'!$A$12)/(M351*SQRT('Other Graphs'!$A$12))","v":0.56691355278504441},{"$f":"O351-M351*SQRT('Other Graphs'!$A$12)","v":-0.33375286715077235},0.71461354207840644,0.36928302623019049,64.666236758813454]
[null,null,null,0.52500000000000036,{"$f":"IF($C$4, 'Other Graphs'!$A$6*H352-EXP(-1*'Other Graphs'!$A$12*D352)*'Other Graphs'!$A$9*I352,-1*'Other Graphs'!$A$6*H352+EXP(-1*'Other Graphs'!$A$12*D352)*'Other Graphs'!$A$9*I352)","v":87.229178642971561},{"$f":"(LN('Other Graphs'!$A$6/'Other Graphs'!$A$9)+(D352+0.5*'Other Graphs'!$A$15^2)*'Other Graphs'!$A$12)/('Other Graphs'!$A$15*SQRT('Other Graphs'!$A$12))","v":4.7198384506251942},{"$f":"F352-'Other Graphs'!$A$15*SQRT('Other Graphs'!$A$12)","v":4.3734282891114189},0.99999881983989514,0.99999388447829929,67.802324747245223,null,null,0.52500000000000036,{"$f":"IF($C$4, 'Other Graphs'!$A$6*Q352-EXP(-1*'Other Graphs'!$A$12*'Other Graphs'!$A$3)*'Other Graphs'!$A$9*R352,-1*'Other Graphs'!$A$6*Q352+EXP(-1*'Other Graphs'!$A$12*'Other Graphs'!$A$3)*'Other Graphs'!$A$9*R352)","v":42.358618740528932},{"$f":"(LN('Other Graphs'!$A$6/'Other Graphs'!$A$9)+('Other Graphs'!$A$3+0.5*M352^2)*'Other Graphs'!$A$12)/(M352*SQRT('Other Graphs'!$A$12))","v":0.57013339082475567},{"$f":"O352-M352*SQRT('Other Graphs'!$A$12)","v":-0.33919328314890551},0.71570638530570641,0.36723206446639933,64.54724726594344]
[null,null,null,0.53000000000000036,{"$f":"IF($C$4, 'Other Graphs'!$A$6*H353-EXP(-1*'Other Graphs'!$A$12*D353)*'Other Graphs'!$A$9*I353,-1*'Other Graphs'!$A$6*H353+EXP(-1*'Other Graphs'!$A$12*D353)*'Other Graphs'!$A$9*I353)","v":87.568190266707788},{"$f":"(LN('Other Graphs'!$A$6/'Other Graphs'!$A$9)+(D353+0.5*'Other Graphs'!$A$15^2)*'Other Graphs'!$A$12)/('Other Graphs'!$A$15*SQRT('Other Graphs'!$A$12))","v":4.7631397208144159},{"$f":"F353-'Other Graphs'!$A$15*SQRT('Other Graphs'!$A$12)","v":4.4167295593006406},0.99999904698116415,0.99999498972634615,66.792946861954704,null,null,0.53000000000000036,{"$f":"IF($C$4, 'Other Graphs'!$A$6*Q353-EXP(-1*'Other Graphs'!$A$12*'Other Graphs'!$A$3)*'Other Graphs'!$A$9*R353,-1*'Other Graphs'!$A$6*Q353+EXP(-1*'Other Graphs'!$A$12*'Other Graphs'!$A$3)*'Other Graphs'!$A$9*R353)","v":42.68135497685865},{"$f":"(LN('Other Graphs'!$A$6/'Other Graphs'!$A$9)+('Other Graphs'!$A$3+0.5*M353^2)*'Other Graphs'!$A$12)/(M353*SQRT('Other Graphs'!$A$12))","v":0.57337417771313137},{"$f":"O353-M353*SQRT('Other Graphs'!$A$12)","v":-0.34461275029837413},0.71680431481783891,0.36519275949733232,64.427039298135412]
[null,null,null,0.53500000000000036,{"$f":"IF($C$4, 'Other Graphs'!$A$6*H354-EXP(-1*'Other Graphs'!$A$12*D354)*'Other Graphs'!$A$9*I354,-1*'Other Graphs'!$A$6*H354+EXP(-1*'Other Graphs'!$A$12*D354)*'Other Graphs'!$A$9*I354)","v":87.902155001017562},{"$f":"(LN('Other Graphs'!$A$6/'Other Graphs'!$A$9)+(D354+0.5*'Other Graphs'!$A$15^2)*'Other Graphs'!$A$12)/('Other Graphs'!$A$15*SQRT('Other Graphs'!$A$12))","v":4.8064409910036376},{"$f":"F354-'Other Graphs'!$A$15*SQRT('Other Graphs'!$A$12)","v":4.4600308294898623},0.99999923179598516,0.99999590260679461,65.798584079820387,null,null,0.53500000000000036,{"$f":"IF($C$4, 'Other Graphs'!$A$6*Q354-EXP(-1*'Other Graphs'!$A$12*'Other Graphs'!$A$3)*'Other Graphs'!$A$9*R354,-1*'Other Graphs'!$A$6*Q354+EXP(-1*'Other Graphs'!$A$12*'Other Graphs'!$A$3)*'Other Graphs'!$A$9*R354)","v":43.003490173349327},{"$f":"(LN('Other Graphs'!$A$6/'Other Graphs'!$A$9)+('Other Graphs'!$A$3+0.5*M354^2)*'Other Graphs'!$A$12)/(M354*SQRT('Other Graphs'!$A$12))","v":0.57663532609927437},{"$f":"O354-M354*SQRT('Other Graphs'!$A$12)","v":-0.35001185595007556},0.71790708497282374,0.363164900002792,64.30562896368167]
[null,null,null,0.54000000000000037,{"$f":"IF($C$4, 'Other Graphs'!$A$6*H355-EXP(-1*'Other Graphs'!$A$12*D355)*'Other Graphs'!$A$9*I355,-1*'Other Graphs'!$A$6*H355+EXP(-1*'Other Graphs'!$A$12*D355)*'Other Graphs'!$A$9*I355)","v":88.231147921416664},{"$f":"(LN('Other Graphs'!$A$6/'Other Graphs'!$A$9)+(D355+0.5*'Other Graphs'!$A$15^2)*'Other Graphs'!$A$12)/('Other Graphs'!$A$15*SQRT('Other Graphs'!$A$12))","v":4.8497422611928593},{"$f":"F355-'Other Graphs'!$A$15*SQRT('Other Graphs'!$A$12)","v":4.503332099679084},0.99999938188999804,0.99999665518888692,64.819015124584155,null,null,0.54000000000000037,{"$f":"IF($C$4, 'Other Graphs'!$A$6*Q355-EXP(-1*'Other Graphs'!$A$12*'Other Graphs'!$A$3)*'Other Graphs'!$A$9*R355,-1*'Other Graphs'!$A$6*Q355+EXP(-1*'Other Graphs'!$A$12*'Other Graphs'!$A$3)*'Other Graphs'!$A$9*R355)","v":43.325018318167736},{"$f":"(LN('Other Graphs'!$A$6/'Other Graphs'!$A$9)+('Other Graphs'!$A$3+0.5*M355^2)*'Other Graphs'!$A$12)/(M355*SQRT('Other Graphs'!$A$12))","v":0.57991627038602445},{"$f":"O355-M355*SQRT('Other Graphs'!$A$12)","v":-0.35539116570116991},0.71901445846940459,0.3611482831134547,64.18303198460643]
[null,null,null,0.54500000000000037,{"$f":"IF($C$4, 'Other Graphs'!$A$6*H356-EXP(-1*'Other Graphs'!$A$12*D356)*'Other Graphs'!$A$9*I356,-1*'Other Graphs'!$A$6*H356+EXP(-1*'Other Graphs'!$A$12*D356)*'Other Graphs'!$A$9*I356)","v":88.555242997039585},{"$f":"(LN('Other Graphs'!$A$6/'Other Graphs'!$A$9)+(D356+0.5*'Other Graphs'!$A$15^2)*'Other Graphs'!$A$12)/('Other Graphs'!$A$15*SQRT('Other Graphs'!$A$12))","v":4.8930435313820819},{"$f":"F356-'Other Graphs'!$A$15*SQRT('Other Graphs'!$A$12)","v":4.5466333698683066},0.99999950355782929,0.9999972744583705,63.854021621290201,null,null,0.54500000000000037,{"$f":"IF($C$4, 'Other Graphs'!$A$6*Q356-EXP(-1*'Other Graphs'!$A$12*'Other Graphs'!$A$3)*'Other Graphs'!$A$9*R356,-1*'Other Graphs'!$A$6*Q356+EXP(-1*'Other Graphs'!$A$12*'Other Graphs'!$A$3)*'Other Graphs'!$A$9*R356)","v":43.645933478090768},{"$f":"(LN('Other Graphs'!$A$6/'Other Graphs'!$A$9)+('Other Graphs'!$A$3+0.5*M356^2)*'Other Graphs'!$A$12)/(M356*SQRT('Other Graphs'!$A$12))","v":0.58321646573208041},{"$f":"O356-M356*SQRT('Other Graphs'!$A$12)","v":-0.36075122439295826},0.72012620597723576,0.35914271401961645,64.059263719182923]
[null,null,null,0.55000000000000038,{"$f":"IF($C$4, 'Other Graphs'!$A$6*H357-EXP(-1*'Other Graphs'!$A$12*D357)*'Other Graphs'!$A$9*I357,-1*'Other Graphs'!$A$6*H357+EXP(-1*'Other Graphs'!$A$12*D357)*'Other Graphs'!$A$9*I357)","v":88.874513105146036},{"$f":"(LN('Other Graphs'!$A$6/'Other Graphs'!$A$9)+(D357+0.5*'Other Graphs'!$A$15^2)*'Other Graphs'!$A$12)/('Other Graphs'!$A$15*SQRT('Other Graphs'!$A$12))","v":4.9363448015713036},{"$f":"F357-'Other Graphs'!$A$15*SQRT('Other Graphs'!$A$12)","v":4.5899346400575283},0.99999960199836968,0.99999778307587583,62.903388117987845,null,null,0.55000000000000038,{"$f":"IF($C$4, 'Other Graphs'!$A$6*Q357-EXP(-1*'Other Graphs'!$A$12*'Other Graphs'!$A$3)*'Other Graphs'!$A$9*R357,-1*'Other Graphs'!$A$6*Q357+EXP(-1*'Other Graphs'!$A$12*'Other Graphs'!$A$3)*'Other Graphs'!$A$9*R357)","v":43.966229796686683},{"$f":"(LN('Other Graphs'!$A$6/'Other Graphs'!$A$9)+('Other Graphs'!$A$3+0.5*M357^2)*'Other Graphs'!$A$12)/(M357*SQRT('Other Graphs'!$A$12))","v":0.58653538710855191},{"$f":"O357-M357*SQRT('Other Graphs'!$A$12)","v":-0.36609255705433119},0.72124210578698,0.35714800560091742,63.934339182978249]
[null,null,null,0.55500000000000038,{"$f":"IF($C$4, 'Other Graphs'!$A$6*H358-EXP(-1*'Other Graphs'!$A$12*D358)*'Other Graphs'!$A$9*I358,-1*'Other Graphs'!$A$6*H358+EXP(-1*'Other Graphs'!$A$12*D358)*'Other Graphs'!$A$9*I358)","v":89.189030045735976},{"$f":"(LN('Other Graphs'!$A$6/'Other Graphs'!$A$9)+(D358+0.5*'Other Graphs'!$A$15^2)*'Other Graphs'!$A$12)/('Other Graphs'!$A$15*SQRT('Other Graphs'!$A$12))","v":4.9796460717605253},{"$f":"F358-'Other Graphs'!$A$15*SQRT('Other Graphs'!$A$12)","v":4.63323591024675},0.99999968149670526,0.99999820003045925,61.966902096972319,null,null,0.55500000000000038,{"$f":"IF($C$4, 'Other Graphs'!$A$6*Q358-EXP(-1*'Other Graphs'!$A$12*'Other Graphs'!$A$3)*'Other Graphs'!$A$9*R358,-1*'Other Graphs'!$A$6*Q358+EXP(-1*'Other Graphs'!$A$12*'Other Graphs'!$A$3)*'Other Graphs'!$A$9*R358)","v":44.285901492601575},{"$f":"(LN('Other Graphs'!$A$6/'Other Graphs'!$A$9)+('Other Graphs'!$A$3+0.5*M358^2)*'Other Graphs'!$A$12)/(M358*SQRT('Other Graphs'!$A$12))","v":0.58987252840650917},{"$f":"O358-M358*SQRT('Other Graphs'!$A$12)","v":-0.37141566979421836},0.72236194347908267,0.35516397807574773,63.808273068610731]
[null,null,null,0.56000000000000039,{"$f":"IF($C$4, 'Other Graphs'!$A$6*H359-EXP(-1*'Other Graphs'!$A$12*D359)*'Other Graphs'!$A$9*I359,-1*'Other Graphs'!$A$6*H359+EXP(-1*'Other Graphs'!$A$12*D359)*'Other Graphs'!$A$9*I359)","v":89.498864556220838},{"$f":"(LN('Other Graphs'!$A$6/'Other Graphs'!$A$9)+(D359+0.5*'Other Graphs'!$A$15^2)*'Other Graphs'!$A$12)/('Other Graphs'!$A$15*SQRT('Other Graphs'!$A$12))","v":5.022947341949747},{"$f":"F359-'Other Graphs'!$A$15*SQRT('Other Graphs'!$A$12)","v":4.6765371804359717},0.99999974557750293,0.99999854120139453,61.044353977251774,null,null,0.56000000000000039,{"$f":"IF($C$4, 'Other Graphs'!$A$6*Q359-EXP(-1*'Other Graphs'!$A$12*'Other Graphs'!$A$3)*'Other Graphs'!$A$9*R359,-1*'Other Graphs'!$A$6*Q359+EXP(-1*'Other Graphs'!$A$12*'Other Graphs'!$A$3)*'Other Graphs'!$A$9*R359)","v":44.604942857944629},{"$f":"(LN('Other Graphs'!$A$6/'Other Graphs'!$A$9)+('Other Graphs'!$A$3+0.5*M359^2)*'Other Graphs'!$A$12)/(M359*SQRT('Other Graphs'!$A$12))","v":0.59322740159234089},{"$f":"O359-M359*SQRT('Other Graphs'!$A$12)","v":-0.37672105064623096},0.7234855116100718,0.35319045866912308,63.681079764170022]
[null,null,null,0.56500000000000039,{"$f":"IF($C$4, 'Other Graphs'!$A$6*H360-EXP(-1*'Other Graphs'!$A$12*D360)*'Other Graphs'!$A$9*I360,-1*'Other Graphs'!$A$6*H360+EXP(-1*'Other Graphs'!$A$12*D360)*'Other Graphs'!$A$9*I360)","v":89.804086326107097},{"$f":"(LN('Other Graphs'!$A$6/'Other Graphs'!$A$9)+(D360+0.5*'Other Graphs'!$A$15^2)*'Other Graphs'!$A$12)/('Other Graphs'!$A$15*SQRT('Other Graphs'!$A$12))","v":5.0662486121389696},{"$f":"F360-'Other Graphs'!$A$15*SQRT('Other Graphs'!$A$12)","v":4.7198384506251942},0.99999979713402409,0.99999881983989514,60.135537109567792,null,null,0.56500000000000039,{"$f":"IF($C$4, 'Other Graphs'!$A$6*Q360-EXP(-1*'Other Graphs'!$A$12*'Other Graphs'!$A$3)*'Other Graphs'!$A$9*R360,-1*'Other Graphs'!$A$6*Q360+EXP(-1*'Other Graphs'!$A$12*'Other Graphs'!$A$3)*'Other Graphs'!$A$9*R360)","v":44.923348256765479},{"$f":"(LN('Other Graphs'!$A$6/'Other Graphs'!$A$9)+('Other Graphs'!$A$3+0.5*M360^2)*'Other Graphs'!$A$12)/(M360*SQRT('Other Graphs'!$A$12))","v":0.59659953590796166},{"$f":"O360-M360*SQRT('Other Graphs'!$A$12)","v":-0.38200917036845461},0.72461260941531636,0.35122728129790909,63.552773370535874]
[null,null,null,0.5700000000000004,{"$f":"IF($C$4, 'Other Graphs'!$A$6*H361-EXP(-1*'Other Graphs'!$A$12*D361)*'Other Graphs'!$A$9*I361,-1*'Other Graphs'!$A$6*H361+EXP(-1*'Other Graphs'!$A$12*D361)*'Other Graphs'!$A$9*I361)","v":90.104764011654936},{"$f":"(LN('Other Graphs'!$A$6/'Other Graphs'!$A$9)+(D361+0.5*'Other Graphs'!$A$15^2)*'Other Graphs'!$A$12)/('Other Graphs'!$A$15*SQRT('Other Graphs'!$A$12))","v":5.1095498823281922},{"$f":"F361-'Other Graphs'!$A$15*SQRT('Other Graphs'!$A$12)","v":4.7631397208144168},0.99999983853638696,0.99999904698116415,59.240247765251247,null,null,0.5700000000000004,{"$f":"IF($C$4, 'Other Graphs'!$A$6*Q361-EXP(-1*'Other Graphs'!$A$12*'Other Graphs'!$A$3)*'Other Graphs'!$A$9*R361,-1*'Other Graphs'!$A$6*Q361+EXP(-1*'Other Graphs'!$A$12*'Other Graphs'!$A$3)*'Other Graphs'!$A$9*R361)","v":45.241112123618159},{"$f":"(LN('Other Graphs'!$A$6/'Other Graphs'!$A$9)+('Other Graphs'!$A$3+0.5*M361^2)*'Other Graphs'!$A$12)/(M361*SQRT('Other Graphs'!$A$12))","v":0.59998847711311409},{"$f":"O361-M361*SQRT('Other Graphs'!$A$12)","v":-0.38728048320114661},0.72574304252724642,0.34927428627234602,63.423367717626832]
[null,null,null,0.5750000000000004,{"$f":"IF($C$4, 'Other Graphs'!$A$6*H362-EXP(-1*'Other Graphs'!$A$12*D362)*'Other Graphs'!$A$9*I362,-1*'Other Graphs'!$A$6*H362+EXP(-1*'Other Graphs'!$A$12*D362)*'Other Graphs'!$A$9*I362)","v":90.400965250481192},{"$f":"(LN('Other Graphs'!$A$6/'Other Graphs'!$A$9)+(D362+0.5*'Other Graphs'!$A$15^2)*'Other Graphs'!$A$12)/('Other Graphs'!$A$15*SQRT('Other Graphs'!$A$12))","v":5.1528511525174139},{"$f":"F362-'Other Graphs'!$A$15*SQRT('Other Graphs'!$A$12)","v":4.8064409910036385},0.99999987172220084,0.99999923179598516,58.358285119893999,null,null,0.5750000000000004,{"$f":"IF($C$4, 'Other Graphs'!$A$6*Q362-EXP(-1*'Other Graphs'!$A$12*'Other Graphs'!$A$3)*'Other Graphs'!$A$9*R362,-1*'Other Graphs'!$A$6*Q362+EXP(-1*'Other Graphs'!$A$12*'Other Graphs'!$A$3)*'Other Graphs'!$A$9*R362)","v":45.558228962206293},{"$f":"(LN('Other Graphs'!$A$6/'Other Graphs'!$A$9)+('Other Graphs'!$A$3+0.5*M362^2)*'Other Graphs'!$A$12)/(M362*SQRT('Other Graphs'!$A$12))","v":0.60339378676720157},{"$f":"O362-M362*SQRT('Other Graphs'!$A$12)","v":-0.39253542758490356},0.72687662270810871,0.3473313200128979,63.292876379557526]
[null,null,null,0.5800000000000004,{"$f":"IF($C$4, 'Other Graphs'!$A$6*H363-EXP(-1*'Other Graphs'!$A$12*D363)*'Other Graphs'!$A$9*I363,-1*'Other Graphs'!$A$6*H363+EXP(-1*'Other Graphs'!$A$12*D363)*'Other Graphs'!$A$9*I363)","v":90.692756676080663},{"$f":"(LN('Other Graphs'!$A$6/'Other Graphs'!$A$9)+(D363+0.5*'Other Graphs'!$A$15^2)*'Other Graphs'!$A$12)/('Other Graphs'!$A$15*SQRT('Other Graphs'!$A$12))","v":5.1961524227066356},{"$f":"F363-'Other Graphs'!$A$15*SQRT('Other Graphs'!$A$12)","v":4.8497422611928602},0.99999989827226932,0.99999938188999804,57.489451232771621,null,null,0.5800000000000004,{"$f":"IF($C$4, 'Other Graphs'!$A$6*Q363-EXP(-1*'Other Graphs'!$A$12*'Other Graphs'!$A$3)*'Other Graphs'!$A$9*R363,-1*'Other Graphs'!$A$6*Q363+EXP(-1*'Other Graphs'!$A$12*'Other Graphs'!$A$3)*'Other Graphs'!$A$9*R363)","v":45.874693344104081},{"$f":"(LN('Other Graphs'!$A$6/'Other Graphs'!$A$9)+('Other Graphs'!$A$3+0.5*M363^2)*'Other Graphs'!$A$12)/(M363*SQRT('Other Graphs'!$A$12))","v":0.60681504154826904},{"$f":"O363-M363*SQRT('Other Graphs'!$A$12)","v":-0.39777442684168041},0.72801316759639167,0.34539823478151799,63.161312688968906]
[null,null,null,0.58500000000000041,{"$f":"IF($C$4, 'Other Graphs'!$A$6*H364-EXP(-1*'Other Graphs'!$A$12*D364)*'Other Graphs'!$A$9*I364,-1*'Other Graphs'!$A$6*H364+EXP(-1*'Other Graphs'!$A$12*D364)*'Other Graphs'!$A$9*I364)","v":90.980203932244521},{"$f":"(LN('Other Graphs'!$A$6/'Other Graphs'!$A$9)+(D364+0.5*'Other Graphs'!$A$15^2)*'Other Graphs'!$A$12)/('Other Graphs'!$A$15*SQRT('Other Graphs'!$A$12))","v":5.2394536928958573},{"$f":"F364-'Other Graphs'!$A$15*SQRT('Other Graphs'!$A$12)","v":4.8930435313820819},0.99999991947367417,0.99999950355782929,56.633551022801448,null,null,0.58500000000000041,{"$f":"IF($C$4, 'Other Graphs'!$A$6*Q364-EXP(-1*'Other Graphs'!$A$12*'Other Graphs'!$A$3)*'Other Graphs'!$A$9*R364,-1*'Other Graphs'!$A$6*Q364+EXP(-1*'Other Graphs'!$A$12*'Other Graphs'!$A$3)*'Other Graphs'!$A$9*R364)","v":46.190499907548926},{"$f":"(LN('Other Graphs'!$A$6/'Other Graphs'!$A$9)+('Other Graphs'!$A$3+0.5*M364^2)*'Other Graphs'!$A$12)/(M364*SQRT('Other Graphs'!$A$12))","v":0.61025183260690674},{"$f":"O364-M364*SQRT('Other Graphs'!$A$12)","v":-0.40299788982088713},0.72915250046611468,0.34347488842648133,63.028689750346643]
[null,null,null,0.59000000000000041,{"$f":"IF($C$4, 'Other Graphs'!$A$6*H365-EXP(-1*'Other Graphs'!$A$12*D365)*'Other Graphs'!$A$9*I365,-1*'Other Graphs'!$A$6*H365+EXP(-1*'Other Graphs'!$A$12*D365)*'Other Graphs'!$A$9*I365)","v":91.263371687358529},{"$f":"(LN('Other Graphs'!$A$6/'Other Graphs'!$A$9)+(D365+0.5*'Other Graphs'!$A$15^2)*'Other Graphs'!$A$12)/('Other Graphs'!$A$15*SQRT('Other Graphs'!$A$12))","v":5.2827549630850799},{"$f":"F365-'Other Graphs'!$A$15*SQRT('Other Graphs'!$A$12)","v":4.9363448015713045},0.99999993637222495,0.99999960199836968,55.790392241607329,null,null,0.59000000000000041,{"$f":"IF($C$4, 'Other Graphs'!$A$6*Q365-EXP(-1*'Other Graphs'!$A$12*'Other Graphs'!$A$3)*'Other Graphs'!$A$9*R365,-1*'Other Graphs'!$A$6*Q365+EXP(-1*'Other Graphs'!$A$12*'Other Graphs'!$A$3)*'Other Graphs'!$A$9*R365)","v":46.505643356300659},{"$f":"(LN('Other Graphs'!$A$6/'Other Graphs'!$A$9)+('Other Graphs'!$A$3+0.5*M365^2)*'Other Graphs'!$A$12)/(M365*SQRT('Other Graphs'!$A$12))","v":0.61370376495300671},{"$f":"O365-M365*SQRT('Other Graphs'!$A$12)","v":-0.40820621151263159},0.73029444999822779,0.34156114413999339,62.895020452667382]
[null,null,null,0.59500000000000042,{"$f":"IF($C$4, 'Other Graphs'!$A$6*H366-EXP(-1*'Other Graphs'!$A$12*D366)*'Other Graphs'!$A$9*I366,-1*'Other Graphs'!$A$6*H366+EXP(-1*'Other Graphs'!$A$12*D366)*'Other Graphs'!$A$9*I366)","v":91.542323648566565},{"$f":"(LN('Other Graphs'!$A$6/'Other Graphs'!$A$9)+(D366+0.5*'Other Graphs'!$A$15^2)*'Other Graphs'!$A$12)/('Other Graphs'!$A$15*SQRT('Other Graphs'!$A$12))","v":5.3260562332743016},{"$f":"F366-'Other Graphs'!$A$15*SQRT('Other Graphs'!$A$12)","v":4.9796460717605262},0.99999994981596507,0.99999968149670526,54.959785444350423,null,null,0.59500000000000042,{"$f":"IF($C$4, 'Other Graphs'!$A$6*Q366-EXP(-1*'Other Graphs'!$A$12*'Other Graphs'!$A$3)*'Other Graphs'!$A$9*R366,-1*'Other Graphs'!$A$6*Q366+EXP(-1*'Other Graphs'!$A$12*'Other Graphs'!$A$3)*'Other Graphs'!$A$9*R366)","v":46.820118458563996},{"$f":"(LN('Other Graphs'!$A$6/'Other Graphs'!$A$9)+('Other Graphs'!$A$3+0.5*M366^2)*'Other Graphs'!$A$12)/(M366*SQRT('Other Graphs'!$A$12))","v":0.61717045687343985},{"$f":"O366-M366*SQRT('Other Graphs'!$A$12)","v":-0.41339977363004288},0.73143885006342046,0.33965687022783475,62.760317481144]
[null,null,null,0.60000000000000042,{"$f":"IF($C$4, 'Other Graphs'!$A$6*H367-EXP(-1*'Other Graphs'!$A$12*D367)*'Other Graphs'!$A$9*I367,-1*'Other Graphs'!$A$6*H367+EXP(-1*'Other Graphs'!$A$12*D367)*'Other Graphs'!$A$9*I367)","v":91.817122575788318},{"$f":"(LN('Other Graphs'!$A$6/'Other Graphs'!$A$9)+(D367+0.5*'Other Graphs'!$A$15^2)*'Other Graphs'!$A$12)/('Other Graphs'!$A$15*SQRT('Other Graphs'!$A$12))","v":5.3693575034635233},{"$f":"F367-'Other Graphs'!$A$15*SQRT('Other Graphs'!$A$12)","v":5.0229473419497479},0.99999996049117867,0.99999974557750293,54.141543958695543,null,null,0.60000000000000042,{"$f":"IF($C$4, 'Other Graphs'!$A$6*Q367-EXP(-1*'Other Graphs'!$A$12*'Other Graphs'!$A$3)*'Other Graphs'!$A$9*R367,-1*'Other Graphs'!$A$6*Q367+EXP(-1*'Other Graphs'!$A$12*'Other Graphs'!$A$3)*'Other Graphs'!$A$9*R367)","v":47.133920045969717},{"$f":"(LN('Other Graphs'!$A$6/'Other Graphs'!$A$9)+('Other Graphs'!$A$3+0.5*M367^2)*'Other Graphs'!$A$12)/(M367*SQRT('Other Graphs'!$A$12))","v":0.62065153937884798},{"$f":"O367-M367*SQRT('Other Graphs'!$A$12)","v":-0.41857894516247895},0.73258553951568017,0.33776193989035175,62.624593328358401]
[null,null,null,0.60500000000000043,{"$f":"IF($C$4, 'Other Graphs'!$A$6*H368-EXP(-1*'Other Graphs'!$A$12*D368)*'Other Graphs'!$A$9*I368,-1*'Other Graphs'!$A$6*H368+EXP(-1*'Other Graphs'!$A$12*D368)*'Other Graphs'!$A$9*I368)","v":92.087830295581796},{"$f":"(LN('Other Graphs'!$A$6/'Other Graphs'!$A$9)+(D368+0.5*'Other Graphs'!$A$15^2)*'Other Graphs'!$A$12)/('Other Graphs'!$A$15*SQRT('Other Graphs'!$A$12))","v":5.4126587736527449},{"$f":"F368-'Other Graphs'!$A$15*SQRT('Other Graphs'!$A$12)","v":5.0662486121389696},0.99999996895212373,0.99999979713402409,53.335483852430293,null,null,0.60500000000000043,{"$f":"IF($C$4, 'Other Graphs'!$A$6*Q368-EXP(-1*'Other Graphs'!$A$12*'Other Graphs'!$A$3)*'Other Graphs'!$A$9*R368,-1*'Other Graphs'!$A$6*Q368+EXP(-1*'Other Graphs'!$A$12*'Other Graphs'!$A$3)*'Other Graphs'!$A$9*R368)","v":47.447043012611509},{"$f":"(LN('Other Graphs'!$A$6/'Other Graphs'!$A$9)+('Other Graphs'!$A$3+0.5*M368^2)*'Other Graphs'!$A$12)/(M368*SQRT('Other Graphs'!$A$12))","v":0.62414665567786787},{"$f":"O368-M368*SQRT('Other Graphs'!$A$12)","v":-0.4237440829013035},0.73373436199598929,0.33587623101414532,62.487860304659591]
[null,null,null,0.61000000000000043,{"$f":"IF($C$4, 'Other Graphs'!$A$6*H369-EXP(-1*'Other Graphs'!$A$12*D369)*'Other Graphs'!$A$9*I369,-1*'Other Graphs'!$A$6*H369+EXP(-1*'Other Graphs'!$A$12*D369)*'Other Graphs'!$A$9*I369)","v":92.354507714843947},{"$f":"(LN('Other Graphs'!$A$6/'Other Graphs'!$A$9)+(D369+0.5*'Other Graphs'!$A$15^2)*'Other Graphs'!$A$12)/('Other Graphs'!$A$15*SQRT('Other Graphs'!$A$12))","v":5.4559600438419675},{"$f":"F369-'Other Graphs'!$A$15*SQRT('Other Graphs'!$A$12)","v":5.1095498823281922},0.99999997564552701,0.99999983853638696,52.541423899913248,null,null,0.61000000000000043,{"$f":"IF($C$4, 'Other Graphs'!$A$6*Q369-EXP(-1*'Other Graphs'!$A$12*'Other Graphs'!$A$3)*'Other Graphs'!$A$9*R369,-1*'Other Graphs'!$A$6*Q369+EXP(-1*'Other Graphs'!$A$12*'Other Graphs'!$A$3)*'Other Graphs'!$A$9*R369)","v":47.759482314134807},{"$f":"(LN('Other Graphs'!$A$6/'Other Graphs'!$A$9)+('Other Graphs'!$A$3+0.5*M369^2)*'Other Graphs'!$A$12)/(M369*SQRT('Other Graphs'!$A$12))","v":0.62765546067721401},{"$f":"O369-M369*SQRT('Other Graphs'!$A$12)","v":-0.42889553193980179},0.73488516574558393,0.33399962597385668,62.35013054796633]
[null,null,null,0.61500000000000044,{"$f":"IF($C$4, 'Other Graphs'!$A$6*H370-EXP(-1*'Other Graphs'!$A$12*D370)*'Other Graphs'!$A$9*I370,-1*'Other Graphs'!$A$6*H370+EXP(-1*'Other Graphs'!$A$12*D370)*'Other Graphs'!$A$9*I370)","v":92.617214834343514},{"$f":"(LN('Other Graphs'!$A$6/'Other Graphs'!$A$9)+(D370+0.5*'Other Graphs'!$A$15^2)*'Other Graphs'!$A$12)/('Other Graphs'!$A$15*SQRT('Other Graphs'!$A$12))","v":5.4992613140311892},{"$f":"F370-'Other Graphs'!$A$15*SQRT('Other Graphs'!$A$12)","v":5.1528511525174139},0.99999998093072096,0.99999987172220084,51.759185547780319,null,null,0.61500000000000044,{"$f":"IF($C$4, 'Other Graphs'!$A$6*Q370-EXP(-1*'Other Graphs'!$A$12*'Other Graphs'!$A$3)*'Other Graphs'!$A$9*R370,-1*'Other Graphs'!$A$6*Q370+EXP(-1*'Other Graphs'!$A$12*'Other Graphs'!$A$3)*'Other Graphs'!$A$9*R370)","v":48.071232966874639},{"$f":"(LN('Other Graphs'!$A$6/'Other Graphs'!$A$9)+('Other Graphs'!$A$3+0.5*M370^2)*'Other Graphs'!$A$12)/(M370*SQRT('Other Graphs'!$A$12))","v":0.63117762050614667},{"$f":"O370-M370*SQRT('Other Graphs'!$A$12)","v":-0.43403362614871355},0.73603780342823721,0.33213201144348053,62.211416032980026]
[null,null,null,0.62000000000000044,{"$f":"IF($C$4, 'Other Graphs'!$A$6*H371-EXP(-1*'Other Graphs'!$A$12*D371)*'Other Graphs'!$A$9*I371,-1*'Other Graphs'!$A$6*H371+EXP(-1*'Other Graphs'!$A$12*D371)*'Other Graphs'!$A$9*I371)","v":92.876010762082416},{"$f":"(LN('Other Graphs'!$A$6/'Other Graphs'!$A$9)+(D371+0.5*'Other Graphs'!$A$15^2)*'Other Graphs'!$A$12)/('Other Graphs'!$A$15*SQRT('Other Graphs'!$A$12))","v":5.5425625842204109},{"$f":"F371-'Other Graphs'!$A$15*SQRT('Other Graphs'!$A$12)","v":5.1961524227066356},0.99999998509615928,0.99999989827226932,50.988592880059926,null,null,0.62000000000000044,{"$f":"IF($C$4, 'Other Graphs'!$A$6*Q371-EXP(-1*'Other Graphs'!$A$12*'Other Graphs'!$A$3)*'Other Graphs'!$A$9*R371,-1*'Other Graphs'!$A$6*Q371+EXP(-1*'Other Graphs'!$A$12*'Other Graphs'!$A$3)*'Other Graphs'!$A$9*R371)","v":48.38229004703954},{"$f":"(LN('Other Graphs'!$A$6/'Other Graphs'!$A$9)+('Other Graphs'!$A$3+0.5*M371^2)*'Other Graphs'!$A$12)/(M371*SQRT('Other Graphs'!$A$12))","v":0.63471281206395014},{"$f":"O371-M371*SQRT('Other Graphs'!$A$12)","v":-0.43915868862875451},0.73719213196106548,0.33027327821667996,62.071728579851936]
[null,null,null,0.62500000000000044,{"$f":"IF($C$4, 'Other Graphs'!$A$6*H372-EXP(-1*'Other Graphs'!$A$12*D372)*'Other Graphs'!$A$9*I372,-1*'Other Graphs'!$A$6*H372+EXP(-1*'Other Graphs'!$A$12*D372)*'Other Graphs'!$A$9*I372)","v":93.130953726482716},{"$f":"(LN('Other Graphs'!$A$6/'Other Graphs'!$A$9)+(D372+0.5*'Other Graphs'!$A$15^2)*'Other Graphs'!$A$12)/('Other Graphs'!$A$15*SQRT('Other Graphs'!$A$12))","v":5.5858638544096335},{"$f":"F372-'Other Graphs'!$A$15*SQRT('Other Graphs'!$A$12)","v":5.2394536928958582},0.99999998837293191,0.99999991947367417,50.229472582918746,null,null,0.62500000000000044,{"$f":"IF($C$4, 'Other Graphs'!$A$6*Q372-EXP(-1*'Other Graphs'!$A$12*'Other Graphs'!$A$3)*'Other Graphs'!$A$9*R372,-1*'Other Graphs'!$A$6*Q372+EXP(-1*'Other Graphs'!$A$12*'Other Graphs'!$A$3)*'Other Graphs'!$A$9*R372)","v":48.6926486899388},{"$f":"(LN('Other Graphs'!$A$6/'Other Graphs'!$A$9)+('Other Graphs'!$A$3+0.5*M372^2)*'Other Graphs'!$A$12)/(M372*SQRT('Other Graphs'!$A$12))","v":0.63826072258913158},{"$f":"O372-M372*SQRT('Other Graphs'!$A$12)","v":-0.4442710321414175},0.73834801235338243,0.32842332103560301,61.931079862324566]
[null,null,null,0.63000000000000045,{"$f":"IF($C$4, 'Other Graphs'!$A$6*H373-EXP(-1*'Other Graphs'!$A$12*D373)*'Other Graphs'!$A$9*I373,-1*'Other Graphs'!$A$6*H373+EXP(-1*'Other Graphs'!$A$12*D373)*'Other Graphs'!$A$9*I373)","v":93.38210108939731},{"$f":"(LN('Other Graphs'!$A$6/'Other Graphs'!$A$9)+(D373+0.5*'Other Graphs'!$A$15^2)*'Other Graphs'!$A$12)/('Other Graphs'!$A$15*SQRT('Other Graphs'!$A$12))","v":5.6291651245988552},{"$f":"F373-'Other Graphs'!$A$15*SQRT('Other Graphs'!$A$12)","v":5.2827549630850799},0.99999999094580116,0.99999993637222495,49.481653909157288,null,null,0.63000000000000045,{"$f":"IF($C$4, 'Other Graphs'!$A$6*Q373-EXP(-1*'Other Graphs'!$A$12*'Other Graphs'!$A$3)*'Other Graphs'!$A$9*R373,-1*'Other Graphs'!$A$6*Q373+EXP(-1*'Other Graphs'!$A$12*'Other Graphs'!$A$3)*'Other Graphs'!$A$9*R373)","v":49.002304089250423},{"$f":"(LN('Other Graphs'!$A$6/'Other Graphs'!$A$9)+('Other Graphs'!$A$3+0.5*M373^2)*'Other Graphs'!$A$12)/(M373*SQRT('Other Graphs'!$A$12))","v":0.6418210492491343},{"$f":"O373-M373*SQRT('Other Graphs'!$A$12)","v":-0.44937095951925921},0.73950530955316118,0.3265820384277382,61.789481415382795]
[null,null,null,0.63500000000000045,{"$f":"IF($C$4, 'Other Graphs'!$A$6*H374-EXP(-1*'Other Graphs'!$A$12*D374)*'Other Graphs'!$A$9*I374,-1*'Other Graphs'!$A$6*H374+EXP(-1*'Other Graphs'!$A$12*D374)*'Other Graphs'!$A$9*I374)","v":93.629509358943096},{"$f":"(LN('Other Graphs'!$A$6/'Other Graphs'!$A$9)+(D374+0.5*'Other Graphs'!$A$15^2)*'Other Graphs'!$A$12)/('Other Graphs'!$A$15*SQRT('Other Graphs'!$A$12))","v":5.6724663947880769},{"$f":"F374-'Other Graphs'!$A$15*SQRT('Other Graphs'!$A$12)","v":5.3260562332743016},0.99999999296219311,0.99999994981596507,48.744968642728239,null,null,0.63500000000000045,{"$f":"IF($C$4, 'Other Graphs'!$A$6*Q374-EXP(-1*'Other Graphs'!$A$12*'Other Graphs'!$A$3)*'Other Graphs'!$A$9*R374,-1*'Other Graphs'!$A$6*Q374+EXP(-1*'Other Graphs'!$A$12*'Other Graphs'!$A$3)*'Other Graphs'!$A$9*R374)","v":49.311251496327337},{"$f":"(LN('Other Graphs'!$A$6/'Other Graphs'!$A$9)+('Other Graphs'!$A$3+0.5*M374^2)*'Other Graphs'!$A$12)/(M374*SQRT('Other Graphs'!$A$12))","v":0.64539349874943497},{"$f":"O374-M374*SQRT('Other Graphs'!$A$12)","v":-0.45445876405680274},0.74066389230068896,0.32474933255037219,61.646944642536937]
[null,null,null,0.64000000000000046,{"$f":"IF($C$4, 'Other Graphs'!$A$6*H375-EXP(-1*'Other Graphs'!$A$12*D375)*'Other Graphs'!$A$9*I375,-1*'Other Graphs'!$A$6*H375+EXP(-1*'Other Graphs'!$A$12*D375)*'Other Graphs'!$A$9*I375)","v":93.873234202156738},{"$f":"(LN('Other Graphs'!$A$6/'Other Graphs'!$A$9)+(D375+0.5*'Other Graphs'!$A$15^2)*'Other Graphs'!$A$12)/('Other Graphs'!$A$15*SQRT('Other Graphs'!$A$12))","v":5.7157676649772986},{"$f":"F375-'Other Graphs'!$A$15*SQRT('Other Graphs'!$A$12)","v":5.3693575034635233},0.99999999453950661,0.99999996049117867,48.019251063126902,null,null,0.64000000000000046,{"$f":"IF($C$4, 'Other Graphs'!$A$6*Q375-EXP(-1*'Other Graphs'!$A$12*'Other Graphs'!$A$3)*'Other Graphs'!$A$9*R375,-1*'Other Graphs'!$A$6*Q375+EXP(-1*'Other Graphs'!$A$12*'Other Graphs'!$A$3)*'Other Graphs'!$A$9*R375)","v":49.619486219540022},{"$f":"(LN('Other Graphs'!$A$6/'Other Graphs'!$A$9)+('Other Graphs'!$A$3+0.5*M375^2)*'Other Graphs'!$A$12)/(M375*SQRT('Other Graphs'!$A$12))","v":0.6489777869609642},{"$f":"O375-M375*SQRT('Other Graphs'!$A$12)","v":-0.45953472988311794},0.74182363298902565,0.32292510904223826,61.503480822497579]
[null,null,null,0.64500000000000046,{"$f":"IF($C$4, 'Other Graphs'!$A$6*H376-EXP(-1*'Other Graphs'!$A$12*D376)*'Other Graphs'!$A$9*I376,-1*'Other Graphs'!$A$6*H376+EXP(-1*'Other Graphs'!$A$12*D376)*'Other Graphs'!$A$9*I376)","v":94.113330457472372},{"$f":"(LN('Other Graphs'!$A$6/'Other Graphs'!$A$9)+(D376+0.5*'Other Graphs'!$A$15^2)*'Other Graphs'!$A$12)/('Other Graphs'!$A$15*SQRT('Other Graphs'!$A$12))","v":5.7590689351665212},{"$f":"F376-'Other Graphs'!$A$15*SQRT('Other Graphs'!$A$12)","v":5.4126587736527458},{"$f":"IF($C$4,NORMSDIST(F376),NORMSDIST(-1*F376))","v":0.99999999577104204},{"$f":"IF($C$4,NORMSDIST(G376),NORMSDIST(-1*G376))","v":0.99999996895212373},{"$f":"(E377-E376)/(D377-D376)","v":47.304337910048801},null,null,{"$f":"M375+0.005","v":0.64500000000000046},{"$f":"IF($C$4, 'Other Graphs'!$A$6*Q376-EXP(-1*'Other Graphs'!$A$12*'Other Graphs'!$A$3)*'Other Graphs'!$A$9*R376,-1*'Other Graphs'!$A$6*Q376+EXP(-1*'Other Graphs'!$A$12*'Other Graphs'!$A$3)*'Other Graphs'!$A$9*R376)","v":49.92700362365251},{"$f":"(LN('Other Graphs'!$A$6/'Other Graphs'!$A$9)+('Other Graphs'!$A$3+0.5*M376^2)*'Other Graphs'!$A$12)/(M376*SQRT('Other Graphs'!$A$12))","v":0.65257363856485584},{"$f":"O376-M376*SQRT('Other Graphs'!$A$12)","v":-0.46459913231707073},{"$f":"IF($C$4,NORMSDIST(O376),NORMSDIST(-1*O376))","v":0.74298440753089778},{"$f":"IF($C$4,NORMSDIST(P376),NORMSDIST(-1*P376))","v":0.32110927688197377},{"$f":"(N377-N376)/(M377-M376)","v":61.359101115692681}]
[null,null,null,{"$f":"D376+0.005","v":0.65000000000000047},{"$f":"IF($C$4, 'Other Graphs'!$A$6*H377-EXP(-1*'Other Graphs'!$A$12*D377)*'Other Graphs'!$A$9*I377,-1*'Other Graphs'!$A$6*H377+EXP(-1*'Other Graphs'!$A$12*D377)*'Other Graphs'!$A$9*I377)","v":94.349852147022617},{"$f":"(LN('Other Graphs'!$A$6/'Other Graphs'!$A$9)+(D377+0.5*'Other Graphs'!$A$15^2)*'Other Graphs'!$A$12)/('Other Graphs'!$A$15*SQRT('Other Graphs'!$A$12))","v":5.8023702053557438},{"$f":"F377-'Other Graphs'!$A$15*SQRT('Other Graphs'!$A$12)","v":5.4559600438419684},0.99999999673079987,0.99999997564552701,46.600068348141079,null,null,0.65000000000000047,{"$f":"IF($C$4, 'Other Graphs'!$A$6*Q377-EXP(-1*'Other Graphs'!$A$12*'Other Graphs'!$A$3)*'Other Graphs'!$A$9*R377,-1*'Other Graphs'!$A$6*Q377+EXP(-1*'Other Graphs'!$A$12*'Other Graphs'!$A$3)*'Other Graphs'!$A$9*R377)","v":50.233799129230974},{"$f":"(LN('Other Graphs'!$A$6/'Other Graphs'!$A$9)+('Other Graphs'!$A$3+0.5*M377^2)*'Other Graphs'!$A$12)/(M377*SQRT('Other Graphs'!$A$12))","v":0.65618078671359426},{"$f":"O377-M377*SQRT('Other Graphs'!$A$12)","v":-0.46965223820617674},0.74414609523169073,0.31930174825302382,61.213816570193501]
[null,null,null,0.65500000000000047,{"$f":"IF($C$4, 'Other Graphs'!$A$6*H378-EXP(-1*'Other Graphs'!$A$12*D378)*'Other Graphs'!$A$9*I378,-1*'Other Graphs'!$A$6*H378+EXP(-1*'Other Graphs'!$A$12*D378)*'Other Graphs'!$A$9*I378)","v":94.582852488763322},{"$f":"(LN('Other Graphs'!$A$6/'Other Graphs'!$A$9)+(D378+0.5*'Other Graphs'!$A$15^2)*'Other Graphs'!$A$12)/('Other Graphs'!$A$15*SQRT('Other Graphs'!$A$12))","v":5.8456714755449646},{"$f":"F378-'Other Graphs'!$A$15*SQRT('Other Graphs'!$A$12)","v":5.4992613140311892},0.99999999747735546,0.99999998093072096,45.906283932072213,null,null,0.65500000000000047,{"$f":"IF($C$4, 'Other Graphs'!$A$6*Q378-EXP(-1*'Other Graphs'!$A$12*'Other Graphs'!$A$3)*'Other Graphs'!$A$9*R378,-1*'Other Graphs'!$A$6*Q378+EXP(-1*'Other Graphs'!$A$12*'Other Graphs'!$A$3)*'Other Graphs'!$A$9*R378)","v":50.539868212081942},{"$f":"(LN('Other Graphs'!$A$6/'Other Graphs'!$A$9)+('Other Graphs'!$A$3+0.5*M378^2)*'Other Graphs'!$A$12)/(M378*SQRT('Other Graphs'!$A$12))","v":0.65979897270767895},{"$f":"O378-M378*SQRT('Other Graphs'!$A$12)","v":-0.47469430624993647},0.74530857866820921,0.31750243841465131,61.067638127431621]
[null,null,null,0.66000000000000048,{"$f":"IF($C$4, 'Other Graphs'!$A$6*H379-EXP(-1*'Other Graphs'!$A$12*D379)*'Other Graphs'!$A$9*I379,-1*'Other Graphs'!$A$6*H379+EXP(-1*'Other Graphs'!$A$12*D379)*'Other Graphs'!$A$9*I379)","v":94.812383908423683},{"$f":"(LN('Other Graphs'!$A$6/'Other Graphs'!$A$9)+(D379+0.5*'Other Graphs'!$A$15^2)*'Other Graphs'!$A$12)/('Other Graphs'!$A$15*SQRT('Other Graphs'!$A$12))","v":5.8889727457341863},{"$f":"F379-'Other Graphs'!$A$15*SQRT('Other Graphs'!$A$12)","v":5.5425625842204109},0.99999999805698236,0.99999998509615928,45.222828571846165,null,null,0.66000000000000048,{"$f":"IF($C$4, 'Other Graphs'!$A$6*Q379-EXP(-1*'Other Graphs'!$A$12*'Other Graphs'!$A$3)*'Other Graphs'!$A$9*R379,-1*'Other Graphs'!$A$6*Q379+EXP(-1*'Other Graphs'!$A$12*'Other Graphs'!$A$3)*'Other Graphs'!$A$9*R379)","v":50.8452064027191},{"$f":"(LN('Other Graphs'!$A$6/'Other Graphs'!$A$9)+('Other Graphs'!$A$3+0.5*M379^2)*'Other Graphs'!$A$12)/(M379*SQRT('Other Graphs'!$A$12))","v":0.6634279456869886},{"$f":"O379-M379*SQRT('Other Graphs'!$A$12)","v":-0.47972558730847126},0.74647174357290913,0.31571126557873574,60.920576627523758]
[null,null,null,0.66500000000000048,{"$f":"IF($C$4, 'Other Graphs'!$A$6*H380-EXP(-1*'Other Graphs'!$A$12*D380)*'Other Graphs'!$A$9*I380,-1*'Other Graphs'!$A$6*H380+EXP(-1*'Other Graphs'!$A$12*D380)*'Other Graphs'!$A$9*I380)","v":95.038498051282915},{"$f":"(LN('Other Graphs'!$A$6/'Other Graphs'!$A$9)+(D380+0.5*'Other Graphs'!$A$15^2)*'Other Graphs'!$A$12)/('Other Graphs'!$A$15*SQRT('Other Graphs'!$A$12))","v":5.9322740159234089},{"$f":"F380-'Other Graphs'!$A$15*SQRT('Other Graphs'!$A$12)","v":5.5858638544096335},0.99999999850616272,0.99999998837293191,44.549548498477478,null,null,0.66500000000000048,{"$f":"IF($C$4, 'Other Graphs'!$A$6*Q380-EXP(-1*'Other Graphs'!$A$12*'Other Graphs'!$A$3)*'Other Graphs'!$A$9*R380,-1*'Other Graphs'!$A$6*Q380+EXP(-1*'Other Graphs'!$A$12*'Other Graphs'!$A$3)*'Other Graphs'!$A$9*R380)","v":51.149809285856719},{"$f":"(LN('Other Graphs'!$A$6/'Other Graphs'!$A$9)+('Other Graphs'!$A$3+0.5*M380^2)*'Other Graphs'!$A$12)/(M380*SQRT('Other Graphs'!$A$12))","v":0.66706746233606673},{"$f":"O380-M380*SQRT('Other Graphs'!$A$12)","v":-0.48474632469723733},0.74763547872331082,0.31392815079205905,60.772642814299559]
[null,null,null,0.67000000000000048,{"$f":"IF($C$4, 'Other Graphs'!$A$6*H381-EXP(-1*'Other Graphs'!$A$12*D381)*'Other Graphs'!$A$9*I381,-1*'Other Graphs'!$A$6*H381+EXP(-1*'Other Graphs'!$A$12*D381)*'Other Graphs'!$A$9*I381)","v":95.261245793775302},{"$f":"(LN('Other Graphs'!$A$6/'Other Graphs'!$A$9)+(D381+0.5*'Other Graphs'!$A$15^2)*'Other Graphs'!$A$12)/('Other Graphs'!$A$15*SQRT('Other Graphs'!$A$12))","v":5.9755752861126314},{"$f":"F381-'Other Graphs'!$A$15*SQRT('Other Graphs'!$A$12)","v":5.6291651245988561},0.99999999885360191,0.99999999094580116,43.886292230027344,null,null,0.67000000000000048,{"$f":"IF($C$4, 'Other Graphs'!$A$6*Q381-EXP(-1*'Other Graphs'!$A$12*'Other Graphs'!$A$3)*'Other Graphs'!$A$9*R381,-1*'Other Graphs'!$A$6*Q381+EXP(-1*'Other Graphs'!$A$12*'Other Graphs'!$A$3)*'Other Graphs'!$A$9*R381)","v":51.453672499928217},{"$f":"(LN('Other Graphs'!$A$6/'Other Graphs'!$A$9)+('Other Graphs'!$A$3+0.5*M381^2)*'Other Graphs'!$A$12)/(M381*SQRT('Other Graphs'!$A$12))","v":0.6707172866026051},{"$f":"O381-M381*SQRT('Other Graphs'!$A$12)","v":-0.48975675446854339},0.74879967583632911,0.31215301782379756,60.623847340018187]
[null,null,null,0.67500000000000049,{"$f":"IF($C$4, 'Other Graphs'!$A$6*H382-EXP(-1*'Other Graphs'!$A$12*D382)*'Other Graphs'!$A$9*I382,-1*'Other Graphs'!$A$6*H382+EXP(-1*'Other Graphs'!$A$12*D382)*'Other Graphs'!$A$9*I382)","v":95.480677254925439},{"$f":"(LN('Other Graphs'!$A$6/'Other Graphs'!$A$9)+(D382+0.5*'Other Graphs'!$A$15^2)*'Other Graphs'!$A$12)/('Other Graphs'!$A$15*SQRT('Other Graphs'!$A$12))","v":6.0188765563018531},{"$f":"F382-'Other Graphs'!$A$15*SQRT('Other Graphs'!$A$12)","v":5.6724663947880778},0.99999999912184134,0.99999999296219311,43.232910538037537,null,null,0.67500000000000049,{"$f":"IF($C$4, 'Other Graphs'!$A$6*Q382-EXP(-1*'Other Graphs'!$A$12*'Other Graphs'!$A$3)*'Other Graphs'!$A$9*R382,-1*'Other Graphs'!$A$6*Q382+EXP(-1*'Other Graphs'!$A$12*'Other Graphs'!$A$3)*'Other Graphs'!$A$9*R382)","v":51.756791736628308},{"$f":"(LN('Other Graphs'!$A$6/'Other Graphs'!$A$9)+('Other Graphs'!$A$3+0.5*M382^2)*'Other Graphs'!$A$12)/(M382*SQRT('Other Graphs'!$A$12))","v":0.67437718942843827},{"$f":"O382-M382*SQRT('Other Graphs'!$A$12)","v":-0.49475710568055464},0.74996422946726349,0.31038579305795266,60.474200769870322]
[null,null,null,0.68000000000000049,{"$f":"IF($C$4, 'Other Graphs'!$A$6*H383-EXP(-1*'Other Graphs'!$A$12*D383)*'Other Graphs'!$A$9*I383,-1*'Other Graphs'!$A$6*H383+EXP(-1*'Other Graphs'!$A$12*D383)*'Other Graphs'!$A$9*I383)","v":95.696841807615627},{"$f":"(LN('Other Graphs'!$A$6/'Other Graphs'!$A$9)+(D383+0.5*'Other Graphs'!$A$15^2)*'Other Graphs'!$A$12)/('Other Graphs'!$A$15*SQRT('Other Graphs'!$A$12))","v":6.0621778264910748},{"$f":"F383-'Other Graphs'!$A$15*SQRT('Other Graphs'!$A$12)","v":5.7157676649772995},0.99999999932854688,0.99999999453950661,42.589256414353791,null,null,0.68000000000000049,{"$f":"IF($C$4, 'Other Graphs'!$A$6*Q383-EXP(-1*'Other Graphs'!$A$12*'Other Graphs'!$A$3)*'Other Graphs'!$A$9*R383,-1*'Other Graphs'!$A$6*Q383+EXP(-1*'Other Graphs'!$A$12*'Other Graphs'!$A$3)*'Other Graphs'!$A$9*R383)","v":52.05916274047766},{"$f":"(LN('Other Graphs'!$A$6/'Other Graphs'!$A$9)+('Other Graphs'!$A$3+0.5*M383^2)*'Other Graphs'!$A$12)/(M383*SQRT('Other Graphs'!$A$12))","v":0.67804694849240499},{"$f":"O383-M383*SQRT('Other Graphs'!$A$12)","v":-0.49974760065443236},0.75112903691321409,0.3086264053904697,60.323713586112092]
[null,null,null,0.6850000000000005,{"$f":"IF($C$4, 'Other Graphs'!$A$6*H384-EXP(-1*'Other Graphs'!$A$12*D384)*'Other Graphs'!$A$9*I384,-1*'Other Graphs'!$A$6*H384+EXP(-1*'Other Graphs'!$A$12*D384)*'Other Graphs'!$A$9*I384)","v":95.909788089687396},{"$f":"(LN('Other Graphs'!$A$6/'Other Graphs'!$A$9)+(D384+0.5*'Other Graphs'!$A$15^2)*'Other Graphs'!$A$12)/('Other Graphs'!$A$15*SQRT('Other Graphs'!$A$12))","v":6.1054790966802965},{"$f":"F384-'Other Graphs'!$A$15*SQRT('Other Graphs'!$A$12)","v":5.7590689351665212},0.99999999948753615,0.99999999577104204,41.955185038347018,null,null,0.6850000000000005,{"$f":"IF($C$4, 'Other Graphs'!$A$6*Q384-EXP(-1*'Other Graphs'!$A$12*'Other Graphs'!$A$3)*'Other Graphs'!$A$9*R384,-1*'Other Graphs'!$A$6*Q384+EXP(-1*'Other Graphs'!$A$12*'Other Graphs'!$A$3)*'Other Graphs'!$A$9*R384)","v":52.360781308408221},{"$f":"(LN('Other Graphs'!$A$6/'Other Graphs'!$A$9)+('Other Graphs'!$A$3+0.5*M384^2)*'Other Graphs'!$A$12)/(M384*SQRT('Other Graphs'!$A$12))","v":0.68172634796447329},{"$f":"O384-M384*SQRT('Other Graphs'!$A$12)","v":-0.50472845522020848},0.75229399812069586,0.30687478613081098,60.172396192092435]
[null,null,null,0.6900000000000005,{"$f":"IF($C$4, 'Other Graphs'!$A$6*H385-EXP(-1*'Other Graphs'!$A$12*D385)*'Other Graphs'!$A$9*I385,-1*'Other Graphs'!$A$6*H385+EXP(-1*'Other Graphs'!$A$12*D385)*'Other Graphs'!$A$9*I385)","v":96.119564014879131},{"$f":"(LN('Other Graphs'!$A$6/'Other Graphs'!$A$9)+(D385+0.5*'Other Graphs'!$A$15^2)*'Other Graphs'!$A$12)/('Other Graphs'!$A$15*SQRT('Other Graphs'!$A$12))","v":6.1487803668695191},{"$f":"F385-'Other Graphs'!$A$15*SQRT('Other Graphs'!$A$12)","v":5.8023702053557438},0.99999999960959496,0.99999999673079987,41.330553744626251,null,null,0.6900000000000005,{"$f":"IF($C$4, 'Other Graphs'!$A$6*Q385-EXP(-1*'Other Graphs'!$A$12*'Other Graphs'!$A$3)*'Other Graphs'!$A$9*R385,-1*'Other Graphs'!$A$6*Q385+EXP(-1*'Other Graphs'!$A$12*'Other Graphs'!$A$3)*'Other Graphs'!$A$9*R385)","v":52.661643289368683},{"$f":"(LN('Other Graphs'!$A$6/'Other Graphs'!$A$9)+('Other Graphs'!$A$3+0.5*M385^2)*'Other Graphs'!$A$12)/(M385*SQRT('Other Graphs'!$A$12))","v":0.68541517827055387},{"$f":"O385-M385*SQRT('Other Graphs'!$A$12)","v":-0.50969987895197233},0.75345901559724215,0.30513086890775687,60.020258915928025]
[null,null,null,0.69500000000000051,{"$f":"IF($C$4, 'Other Graphs'!$A$6*H386-EXP(-1*'Other Graphs'!$A$12*D386)*'Other Graphs'!$A$9*I386,-1*'Other Graphs'!$A$6*H386+EXP(-1*'Other Graphs'!$A$12*D386)*'Other Graphs'!$A$9*I386)","v":96.326216783602263},{"$f":"(LN('Other Graphs'!$A$6/'Other Graphs'!$A$9)+(D386+0.5*'Other Graphs'!$A$15^2)*'Other Graphs'!$A$12)/('Other Graphs'!$A$15*SQRT('Other Graphs'!$A$12))","v":6.1920816370587399},{"$f":"F386-'Other Graphs'!$A$15*SQRT('Other Graphs'!$A$12)","v":5.8456714755449646},0.99999999970312603,0.99999999747735546,40.715221991101167,null,null,0.69500000000000051,{"$f":"IF($C$4, 'Other Graphs'!$A$6*Q386-EXP(-1*'Other Graphs'!$A$12*'Other Graphs'!$A$3)*'Other Graphs'!$A$9*R386,-1*'Other Graphs'!$A$6*Q386+EXP(-1*'Other Graphs'!$A$12*'Other Graphs'!$A$3)*'Other Graphs'!$A$9*R386)","v":52.961744583948324},{"$f":"(LN('Other Graphs'!$A$6/'Other Graphs'!$A$9)+('Other Graphs'!$A$3+0.5*M386^2)*'Other Graphs'!$A$12)/(M386*SQRT('Other Graphs'!$A$12))","v":0.68911323586746687},{"$f":"O386-M386*SQRT('Other Graphs'!$A$12)","v":-0.51466207539290376},0.75462399432679628,0.30339458957922882,59.867312014007673]
[null,null,null,0.70000000000000051,{"$f":"IF($C$4, 'Other Graphs'!$A$6*H387-EXP(-1*'Other Graphs'!$A$12*D387)*'Other Graphs'!$A$9*I387,-1*'Other Graphs'!$A$6*H387+EXP(-1*'Other Graphs'!$A$12*D387)*'Other Graphs'!$A$9*I387)","v":96.529792893557769},{"$f":"(LN('Other Graphs'!$A$6/'Other Graphs'!$A$9)+(D387+0.5*'Other Graphs'!$A$15^2)*'Other Graphs'!$A$12)/('Other Graphs'!$A$15*SQRT('Other Graphs'!$A$12))","v":6.2353829072479625},{"$f":"F387-'Other Graphs'!$A$15*SQRT('Other Graphs'!$A$12)","v":5.8889727457341872},0.99999999977466281,0.99999999805698236,40.109051327556209,null,null,0.70000000000000051,{"$f":"IF($C$4, 'Other Graphs'!$A$6*Q387-EXP(-1*'Other Graphs'!$A$12*'Other Graphs'!$A$3)*'Other Graphs'!$A$9*R387,-1*'Other Graphs'!$A$6*Q387+EXP(-1*'Other Graphs'!$A$12*'Other Graphs'!$A$3)*'Other Graphs'!$A$9*R387)","v":53.261081144018362},{"$f":"(LN('Other Graphs'!$A$6/'Other Graphs'!$A$9)+('Other Graphs'!$A$3+0.5*M387^2)*'Other Graphs'!$A$12)/(M387*SQRT('Other Graphs'!$A$12))","v":0.69282032302755137},{"$f":"O387-M387*SQRT('Other Graphs'!$A$12)","v":-0.51961524227066347},0.75578884168870342,0.30166588614593315,59.71356567435317]
[null,null,null,0.70500000000000052,{"$f":"IF($C$4, 'Other Graphs'!$A$6*H388-EXP(-1*'Other Graphs'!$A$12*D388)*'Other Graphs'!$A$9*I388,-1*'Other Graphs'!$A$6*H388+EXP(-1*'Other Graphs'!$A$12*D388)*'Other Graphs'!$A$9*I388)","v":96.73033815019555},{"$f":"(LN('Other Graphs'!$A$6/'Other Graphs'!$A$9)+(D388+0.5*'Other Graphs'!$A$15^2)*'Other Graphs'!$A$12)/('Other Graphs'!$A$15*SQRT('Other Graphs'!$A$12))","v":6.2786841774371851},{"$f":"F388-'Other Graphs'!$A$15*SQRT('Other Graphs'!$A$12)","v":5.9322740159234097},0.99999999982927479,0.99999999850616272,39.511905364588493,null,null,0.70500000000000052,{"$f":"IF($C$4, 'Other Graphs'!$A$6*Q388-EXP(-1*'Other Graphs'!$A$12*'Other Graphs'!$A$3)*'Other Graphs'!$A$9*R388,-1*'Other Graphs'!$A$6*Q388+EXP(-1*'Other Graphs'!$A$12*'Other Graphs'!$A$3)*'Other Graphs'!$A$9*R388)","v":53.559648972390129},{"$f":"(LN('Other Graphs'!$A$6/'Other Graphs'!$A$9)+('Other Graphs'!$A$3+0.5*M388^2)*'Other Graphs'!$A$12)/(M388*SQRT('Other Graphs'!$A$12))","v":0.69653624763244215},{"$f":"O388-M388*SQRT('Other Graphs'!$A$12)","v":-0.52455957170361711},0.75695346738012614,0.29994469866864037,59.559030019653342]
[null,null,null,0.71000000000000052,{"$f":"IF($C$4, 'Other Graphs'!$A$6*H389-EXP(-1*'Other Graphs'!$A$12*D389)*'Other Graphs'!$A$9*I389,-1*'Other Graphs'!$A$6*H389+EXP(-1*'Other Graphs'!$A$12*D389)*'Other Graphs'!$A$9*I389)","v":96.927897677018493},{"$f":"(LN('Other Graphs'!$A$6/'Other Graphs'!$A$9)+(D389+0.5*'Other Graphs'!$A$15^2)*'Other Graphs'!$A$12)/('Other Graphs'!$A$15*SQRT('Other Graphs'!$A$12))","v":6.3219854476264068},{"$f":"F389-'Other Graphs'!$A$15*SQRT('Other Graphs'!$A$12)","v":5.9755752861126314},0.99999999987088817,0.99999999885360191,38.923649743043107,null,null,0.71000000000000052,{"$f":"IF($C$4, 'Other Graphs'!$A$6*Q389-EXP(-1*'Other Graphs'!$A$12*'Other Graphs'!$A$3)*'Other Graphs'!$A$9*R389,-1*'Other Graphs'!$A$6*Q389+EXP(-1*'Other Graphs'!$A$12*'Other Graphs'!$A$3)*'Other Graphs'!$A$9*R389)","v":53.857444122488396},{"$f":"(LN('Other Graphs'!$A$6/'Other Graphs'!$A$9)+('Other Graphs'!$A$3+0.5*M389^2)*'Other Graphs'!$A$12)/(M389*SQRT('Other Graphs'!$A$12))","v":0.70026082297555847},{"$f":"O389-M389*SQRT('Other Graphs'!$A$12)","v":-0.52949525039834522},0.75811778334171476,0.29823096918892322,59.403715110231254]
[null,null,null,0.71500000000000052,{"$f":"IF($C$4, 'Other Graphs'!$A$6*H390-EXP(-1*'Other Graphs'!$A$12*D390)*'Other Graphs'!$A$9*I390,-1*'Other Graphs'!$A$6*H390+EXP(-1*'Other Graphs'!$A$12*D390)*'Other Graphs'!$A$9*I390)","v":97.122515925733708},{"$f":"(LN('Other Graphs'!$A$6/'Other Graphs'!$A$9)+(D390+0.5*'Other Graphs'!$A$15^2)*'Other Graphs'!$A$12)/('Other Graphs'!$A$15*SQRT('Other Graphs'!$A$12))","v":6.3652867178156294},{"$f":"F390-'Other Graphs'!$A$15*SQRT('Other Graphs'!$A$12)","v":6.018876556301854},0.99999999990253741,0.99999999912184134,38.344152103857674,null,null,0.71500000000000052,{"$f":"IF($C$4, 'Other Graphs'!$A$6*Q390-EXP(-1*'Other Graphs'!$A$12*'Other Graphs'!$A$3)*'Other Graphs'!$A$9*R390,-1*'Other Graphs'!$A$6*Q390+EXP(-1*'Other Graphs'!$A$12*'Other Graphs'!$A$3)*'Other Graphs'!$A$9*R390)","v":54.154462698039552},{"$f":"(LN('Other Graphs'!$A$6/'Other Graphs'!$A$9)+('Other Graphs'!$A$3+0.5*M390^2)*'Other Graphs'!$A$12)/(M390*SQRT('Other Graphs'!$A$12))","v":0.70399386757288207},{"$f":"O390-M390*SQRT('Other Graphs'!$A$12)","v":-0.53442245983886605},0.75928170368637349,0.29652464165318637,59.247630946802538]
[null,null,null,0.72000000000000053,{"$f":"IF($C$4, 'Other Graphs'!$A$6*H391-EXP(-1*'Other Graphs'!$A$12*D391)*'Other Graphs'!$A$9*I391,-1*'Other Graphs'!$A$6*H391+EXP(-1*'Other Graphs'!$A$12*D391)*'Other Graphs'!$A$9*I391)","v":97.314236686252997},{"$f":"(LN('Other Graphs'!$A$6/'Other Graphs'!$A$9)+(D391+0.5*'Other Graphs'!$A$15^2)*'Other Graphs'!$A$12)/('Other Graphs'!$A$15*SQRT('Other Graphs'!$A$12))","v":6.4085879880048502},{"$f":"F391-'Other Graphs'!$A$15*SQRT('Other Graphs'!$A$12)","v":6.0621778264910748},0.9999999999265633,0.99999999932854688,37.773282058336086,null,null,0.72000000000000053,{"$f":"IF($C$4, 'Other Graphs'!$A$6*Q391-EXP(-1*'Other Graphs'!$A$12*'Other Graphs'!$A$3)*'Other Graphs'!$A$9*R391,-1*'Other Graphs'!$A$6*Q391+EXP(-1*'Other Graphs'!$A$12*'Other Graphs'!$A$3)*'Other Graphs'!$A$9*R391)","v":54.450700852773565},{"$f":"(LN('Other Graphs'!$A$6/'Other Graphs'!$A$9)+('Other Graphs'!$A$3+0.5*M391^2)*'Other Graphs'!$A$12)/(M391*SQRT('Other Graphs'!$A$12))","v":0.70773520498161657},{"$f":"O391-M391*SQRT('Other Graphs'!$A$12)","v":-0.53934137646797597},0.76044514463097435,0.29482566183982889,59.09078747305751]
[null,null,null,0.72500000000000053,{"$f":"IF($C$4, 'Other Graphs'!$A$6*H392-EXP(-1*'Other Graphs'!$A$12*D392)*'Other Graphs'!$A$9*I392,-1*'Other Graphs'!$A$6*H392+EXP(-1*'Other Graphs'!$A$12*D392)*'Other Graphs'!$A$9*I392)","v":97.503103096544677},{"$f":"(LN('Other Graphs'!$A$6/'Other Graphs'!$A$9)+(D392+0.5*'Other Graphs'!$A$15^2)*'Other Graphs'!$A$12)/('Other Graphs'!$A$15*SQRT('Other Graphs'!$A$12))","v":6.4518892581940728},{"$f":"F392-'Other Graphs'!$A$15*SQRT('Other Graphs'!$A$12)","v":6.1054790966802974},0.99999999994476785,0.99999999948753615,37.210911158865621,null,null,0.72500000000000053,{"$f":"IF($C$4, 'Other Graphs'!$A$6*Q392-EXP(-1*'Other Graphs'!$A$12*'Other Graphs'!$A$3)*'Other Graphs'!$A$9*R392,-1*'Other Graphs'!$A$6*Q392+EXP(-1*'Other Graphs'!$A$12*'Other Graphs'!$A$3)*'Other Graphs'!$A$9*R392)","v":54.746154790138853},{"$f":"(LN('Other Graphs'!$A$6/'Other Graphs'!$A$9)+('Other Graphs'!$A$3+0.5*M392^2)*'Other Graphs'!$A$12)/(M392*SQRT('Other Graphs'!$A$12))","v":0.71148466362635387},{"$f":"O392-M392*SQRT('Other Graphs'!$A$12)","v":-0.5442521718610831},0.76160802443087672,0.29313397728939428,58.933194578072751]
[null,null,null,0.73000000000000054,{"$f":"IF($C$4, 'Other Graphs'!$A$6*H393-EXP(-1*'Other Graphs'!$A$12*D393)*'Other Graphs'!$A$9*I393,-1*'Other Graphs'!$A$6*H393+EXP(-1*'Other Graphs'!$A$12*D393)*'Other Graphs'!$A$9*I393)","v":97.689157652339006},{"$f":"(LN('Other Graphs'!$A$6/'Other Graphs'!$A$9)+(D393+0.5*'Other Graphs'!$A$15^2)*'Other Graphs'!$A$12)/('Other Graphs'!$A$15*SQRT('Other Graphs'!$A$12))","v":6.4951905283832954},{"$f":"F393-'Other Graphs'!$A$15*SQRT('Other Graphs'!$A$12)","v":6.14878036686952},0.99999999995853583,0.99999999960959496,36.656912870034795,null,null,0.73000000000000054,{"$f":"IF($C$4, 'Other Graphs'!$A$6*Q393-EXP(-1*'Other Graphs'!$A$12*'Other Graphs'!$A$3)*'Other Graphs'!$A$9*R393,-1*'Other Graphs'!$A$6*Q393+EXP(-1*'Other Graphs'!$A$12*'Other Graphs'!$A$3)*'Other Graphs'!$A$9*R393)","v":55.040820763029217},{"$f":"(LN('Other Graphs'!$A$6/'Other Graphs'!$A$9)+('Other Graphs'!$A$3+0.5*M393^2)*'Other Graphs'!$A$12)/(M393*SQRT('Other Graphs'!$A$12))","v":0.71524207663238148},{"$f":"O393-M393*SQRT('Other Graphs'!$A$12)","v":-0.5491550128928997},0.76277026331711628,0.29144953723756212,58.774862098664421]
[null,null,null,0.73500000000000054,{"$f":"IF($C$4, 'Other Graphs'!$A$6*H394-EXP(-1*'Other Graphs'!$A$12*D394)*'Other Graphs'!$A$9*I394,-1*'Other Graphs'!$A$6*H394+EXP(-1*'Other Graphs'!$A$12*D394)*'Other Graphs'!$A$9*I394)","v":97.87244221668918},{"$f":"(LN('Other Graphs'!$A$6/'Other Graphs'!$A$9)+(D394+0.5*'Other Graphs'!$A$15^2)*'Other Graphs'!$A$12)/('Other Graphs'!$A$15*SQRT('Other Graphs'!$A$12))","v":6.5384917985725162},{"$f":"F394-'Other Graphs'!$A$15*SQRT('Other Graphs'!$A$12)","v":6.1920816370587408},0.99999999996892885,0.99999999970312603,36.111162540223027,null,null,0.73500000000000054,{"$f":"IF($C$4, 'Other Graphs'!$A$6*Q394-EXP(-1*'Other Graphs'!$A$12*'Other Graphs'!$A$3)*'Other Graphs'!$A$9*R394,-1*'Other Graphs'!$A$6*Q394+EXP(-1*'Other Graphs'!$A$12*'Other Graphs'!$A$3)*'Other Graphs'!$A$9*R394)","v":55.334695073522539},{"$f":"(LN('Other Graphs'!$A$6/'Other Graphs'!$A$9)+('Other Graphs'!$A$3+0.5*M394^2)*'Other Graphs'!$A$12)/(M394*SQRT('Other Graphs'!$A$12))","v":0.71900728166579531},{"$f":"O394-M394*SQRT('Other Graphs'!$A$12)","v":-0.5540500618973303},0.76393178343614121,0.28977229255085107,58.615799821478682]
[null,null,null,0.74000000000000055,{"$f":"IF($C$4, 'Other Graphs'!$A$6*H395-EXP(-1*'Other Graphs'!$A$12*D395)*'Other Graphs'!$A$9*I395,-1*'Other Graphs'!$A$6*H395+EXP(-1*'Other Graphs'!$A$12*D395)*'Other Graphs'!$A$9*I395)","v":98.052998029390295},{"$f":"(LN('Other Graphs'!$A$6/'Other Graphs'!$A$9)+(D395+0.5*'Other Graphs'!$A$15^2)*'Other Graphs'!$A$12)/('Other Graphs'!$A$15*SQRT('Other Graphs'!$A$12))","v":6.5817930687617379},{"$f":"F395-'Other Graphs'!$A$15*SQRT('Other Graphs'!$A$12)","v":6.2353829072479625},0.99999999997675959,0.99999999977466281,35.573537373554103,null,null,0.74000000000000055,{"$f":"IF($C$4, 'Other Graphs'!$A$6*Q395-EXP(-1*'Other Graphs'!$A$12*'Other Graphs'!$A$3)*'Other Graphs'!$A$9*R395,-1*'Other Graphs'!$A$6*Q395+EXP(-1*'Other Graphs'!$A$12*'Other Graphs'!$A$3)*'Other Graphs'!$A$9*R395)","v":55.627774072629933},{"$f":"(LN('Other Graphs'!$A$6/'Other Graphs'!$A$9)+('Other Graphs'!$A$3+0.5*M395^2)*'Other Graphs'!$A$12)/(M395*SQRT('Other Graphs'!$A$12))","v":0.72278012078009413},{"$f":"O395-M395*SQRT('Other Graphs'!$A$12)","v":-0.55893747682087591},0.76509250879197088,0.28810219566490719,58.456017485045159]
[null,null,null,0.74500000000000055,{"$f":"IF($C$4, 'Other Graphs'!$A$6*H396-EXP(-1*'Other Graphs'!$A$12*D396)*'Other Graphs'!$A$9*I396,-1*'Other Graphs'!$A$6*H396+EXP(-1*'Other Graphs'!$A$12*D396)*'Other Graphs'!$A$9*I396)","v":98.230865716258066},{"$f":"(LN('Other Graphs'!$A$6/'Other Graphs'!$A$9)+(D396+0.5*'Other Graphs'!$A$15^2)*'Other Graphs'!$A$12)/('Other Graphs'!$A$15*SQRT('Other Graphs'!$A$12))","v":6.6250943389509604},{"$f":"F396-'Other Graphs'!$A$15*SQRT('Other Graphs'!$A$12)","v":6.2786841774371851},0.99999999998264866,0.99999999982927479,35.04391640228161,null,null,0.74500000000000055,{"$f":"IF($C$4, 'Other Graphs'!$A$6*Q396-EXP(-1*'Other Graphs'!$A$12*'Other Graphs'!$A$3)*'Other Graphs'!$A$9*R396,-1*'Other Graphs'!$A$6*Q396+EXP(-1*'Other Graphs'!$A$12*'Other Graphs'!$A$3)*'Other Graphs'!$A$9*R396)","v":55.920054160055159},{"$f":"(LN('Other Graphs'!$A$6/'Other Graphs'!$A$9)+('Other Graphs'!$A$3+0.5*M396^2)*'Other Graphs'!$A$12)/(M396*SQRT('Other Graphs'!$A$12))","v":0.72656044026895183},{"$f":"O396-M396*SQRT('Other Graphs'!$A$12)","v":-0.56381741136986263},0.76625236519066708,0.28643920052525629,58.295524781675518]
[null,null,null,0.75000000000000056,{"$f":"IF($C$4, 'Other Graphs'!$A$6*H397-EXP(-1*'Other Graphs'!$A$12*D397)*'Other Graphs'!$A$9*I397,-1*'Other Graphs'!$A$6*H397+EXP(-1*'Other Graphs'!$A$12*D397)*'Other Graphs'!$A$9*I397)","v":98.406085298269474},{"$f":"(LN('Other Graphs'!$A$6/'Other Graphs'!$A$9)+(D397+0.5*'Other Graphs'!$A$15^2)*'Other Graphs'!$A$12)/('Other Graphs'!$A$15*SQRT('Other Graphs'!$A$12))","v":6.668395609140183},{"$f":"F397-'Other Graphs'!$A$15*SQRT('Other Graphs'!$A$12)","v":6.3219854476264077},0.99999999998706923,0.99999999987088817,34.522180459592249,null,null,0.75000000000000056,{"$f":"IF($C$4, 'Other Graphs'!$A$6*Q397-EXP(-1*'Other Graphs'!$A$12*'Other Graphs'!$A$3)*'Other Graphs'!$A$9*R397,-1*'Other Graphs'!$A$6*Q397+EXP(-1*'Other Graphs'!$A$12*'Other Graphs'!$A$3)*'Other Graphs'!$A$9*R397)","v":56.211531783963537},{"$f":"(LN('Other Graphs'!$A$6/'Other Graphs'!$A$9)+('Other Graphs'!$A$3+0.5*M397^2)*'Other Graphs'!$A$12)/(M397*SQRT('Other Graphs'!$A$12))","v":0.73034809052487715},{"$f":"O397-M397*SQRT('Other Graphs'!$A$12)","v":-0.56869001515178175},0.76741128018700799,0.28478326253040775,58.13433135927108]
[null,null,null,0.75500000000000056,{"$f":"IF($C$4, 'Other Graphs'!$A$6*H398-EXP(-1*'Other Graphs'!$A$12*D398)*'Other Graphs'!$A$9*I398,-1*'Other Graphs'!$A$6*H398+EXP(-1*'Other Graphs'!$A$12*D398)*'Other Graphs'!$A$9*I398)","v":98.578696200567435},{"$f":"(LN('Other Graphs'!$A$6/'Other Graphs'!$A$9)+(D398+0.5*'Other Graphs'!$A$15^2)*'Other Graphs'!$A$12)/('Other Graphs'!$A$15*SQRT('Other Graphs'!$A$12))","v":6.7116968793294047},{"$f":"F398-'Other Graphs'!$A$15*SQRT('Other Graphs'!$A$12)","v":6.3652867178156294},0.99999999999038125,0.99999999990253741,34.008212152821187,null,null,0.75500000000000056,{"$f":"IF($C$4, 'Other Graphs'!$A$6*Q398-EXP(-1*'Other Graphs'!$A$12*'Other Graphs'!$A$3)*'Other Graphs'!$A$9*R398,-1*'Other Graphs'!$A$6*Q398+EXP(-1*'Other Graphs'!$A$12*'Other Graphs'!$A$3)*'Other Graphs'!$A$9*R398)","v":56.502203440759892},{"$f":"(LN('Other Graphs'!$A$6/'Other Graphs'!$A$9)+('Other Graphs'!$A$3+0.5*M398^2)*'Other Graphs'!$A$12)/(M398*SQRT('Other Graphs'!$A$12))","v":0.73414292590349106},{"$f":"O398-M398*SQRT('Other Graphs'!$A$12)","v":-0.57355543381101226},0.76856918303326494,0.28313433847720293,57.972446822935758]
[null,null,null,0.76000000000000056,{"$f":"IF($C$4, 'Other Graphs'!$A$6*H399-EXP(-1*'Other Graphs'!$A$12*D399)*'Other Graphs'!$A$9*I399,-1*'Other Graphs'!$A$6*H399+EXP(-1*'Other Graphs'!$A$12*D399)*'Other Graphs'!$A$9*I399)","v":98.748737261331542},{"$f":"(LN('Other Graphs'!$A$6/'Other Graphs'!$A$9)+(D399+0.5*'Other Graphs'!$A$15^2)*'Other Graphs'!$A$12)/('Other Graphs'!$A$15*SQRT('Other Graphs'!$A$12))","v":6.7549981495186264},{"$f":"F399-'Other Graphs'!$A$15*SQRT('Other Graphs'!$A$12)","v":6.4085879880048511},0.99999999999285816,0.9999999999265633,33.501895836999978,null,null,0.76000000000000056,{"$f":"IF($C$4, 'Other Graphs'!$A$6*Q399-EXP(-1*'Other Graphs'!$A$12*'Other Graphs'!$A$3)*'Other Graphs'!$A$9*R399,-1*'Other Graphs'!$A$6*Q399+EXP(-1*'Other Graphs'!$A$12*'Other Graphs'!$A$3)*'Other Graphs'!$A$9*R399)","v":56.792065674874571},{"$f":"(LN('Other Graphs'!$A$6/'Other Graphs'!$A$9)+('Other Graphs'!$A$3+0.5*M399^2)*'Other Graphs'!$A$12)/(M399*SQRT('Other Graphs'!$A$12))","v":0.73794480459316159},{"$f":"O399-M399*SQRT('Other Graphs'!$A$12)","v":-0.57841380915918617},0.76972600462998264,0.2814923865083061,57.809880736588987]
[null,null,null,0.76500000000000057,{"$f":"IF($C$4, 'Other Graphs'!$A$6*H400-EXP(-1*'Other Graphs'!$A$12*D400)*'Other Graphs'!$A$9*I400,-1*'Other Graphs'!$A$6*H400+EXP(-1*'Other Graphs'!$A$12*D400)*'Other Graphs'!$A$9*I400)","v":98.916246740516542},{"$f":"(LN('Other Graphs'!$A$6/'Other Graphs'!$A$9)+(D400+0.5*'Other Graphs'!$A$15^2)*'Other Graphs'!$A$12)/('Other Graphs'!$A$15*SQRT('Other Graphs'!$A$12))","v":6.7982994197078481},{"$f":"F400-'Other Graphs'!$A$15*SQRT('Other Graphs'!$A$12)","v":6.4518892581940728},0.9999999999947069,0.99999999994476785,33.003117588896174,null,null,0.76500000000000057,{"$f":"IF($C$4, 'Other Graphs'!$A$6*Q400-EXP(-1*'Other Graphs'!$A$12*'Other Graphs'!$A$3)*'Other Graphs'!$A$9*R400,-1*'Other Graphs'!$A$6*Q400+EXP(-1*'Other Graphs'!$A$12*'Other Graphs'!$A$3)*'Other Graphs'!$A$9*R400)","v":57.081115078557517},{"$f":"(LN('Other Graphs'!$A$6/'Other Graphs'!$A$9)+('Other Graphs'!$A$3+0.5*M400^2)*'Other Graphs'!$A$12)/(M400*SQRT('Other Graphs'!$A$12))","v":0.74175358848975059},{"$f":"O400-M400*SQRT('Other Graphs'!$A$12)","v":-0.58326527930044136},0.77088167747867442,0.27985736606174227,57.646642624459282]
[null,null,null,0.77000000000000057,{"$f":"IF($C$4, 'Other Graphs'!$A$6*H401-EXP(-1*'Other Graphs'!$A$12*D401)*'Other Graphs'!$A$9*I401,-1*'Other Graphs'!$A$6*H401+EXP(-1*'Other Graphs'!$A$12*D401)*'Other Graphs'!$A$9*I401)","v":99.081262328461023},{"$f":"(LN('Other Graphs'!$A$6/'Other Graphs'!$A$9)+(D401+0.5*'Other Graphs'!$A$15^2)*'Other Graphs'!$A$12)/('Other Graphs'!$A$15*SQRT('Other Graphs'!$A$12))","v":6.8416006898970707},{"$f":"F401-'Other Graphs'!$A$15*SQRT('Other Graphs'!$A$12)","v":6.4951905283832954},0.99999999999608435,0.99999999995853583,32.511765181328627,null,null,0.77000000000000057,{"$f":"IF($C$4, 'Other Graphs'!$A$6*Q401-EXP(-1*'Other Graphs'!$A$12*'Other Graphs'!$A$3)*'Other Graphs'!$A$9*R401,-1*'Other Graphs'!$A$6*Q401+EXP(-1*'Other Graphs'!$A$12*'Other Graphs'!$A$3)*'Other Graphs'!$A$9*R401)","v":57.369348291679813},{"$f":"(LN('Other Graphs'!$A$6/'Other Graphs'!$A$9)+('Other Graphs'!$A$3+0.5*M401^2)*'Other Graphs'!$A$12)/(M401*SQRT('Other Graphs'!$A$12))","v":0.74556914307624},{"$f":"O401-M401*SQRT('Other Graphs'!$A$12)","v":-0.58810997875179638},0.77203613563634355,0.27822923782238751,57.482741972391644]
[null,null,null,0.77500000000000058,{"$f":"IF($C$4, 'Other Graphs'!$A$6*H402-EXP(-1*'Other Graphs'!$A$12*D402)*'Other Graphs'!$A$9*I402,-1*'Other Graphs'!$A$6*H402+EXP(-1*'Other Graphs'!$A$12*D402)*'Other Graphs'!$A$9*I402)","v":99.243821154367666},{"$f":"(LN('Other Graphs'!$A$6/'Other Graphs'!$A$9)+(D402+0.5*'Other Graphs'!$A$15^2)*'Other Graphs'!$A$12)/('Other Graphs'!$A$15*SQRT('Other Graphs'!$A$12))","v":6.8849019600862915},{"$f":"F402-'Other Graphs'!$A$15*SQRT('Other Graphs'!$A$12)","v":6.5384917985725162},0.99999999999710865,0.99999999996892885,32.027728057991538,null,null,0.77500000000000058,{"$f":"IF($C$4, 'Other Graphs'!$A$6*Q402-EXP(-1*'Other Graphs'!$A$12*'Other Graphs'!$A$3)*'Other Graphs'!$A$9*R402,-1*'Other Graphs'!$A$6*Q402+EXP(-1*'Other Graphs'!$A$12*'Other Graphs'!$A$3)*'Other Graphs'!$A$9*R402)","v":57.656762001541772},{"$f":"(LN('Other Graphs'!$A$6/'Other Graphs'!$A$9)+('Other Graphs'!$A$3+0.5*M402^2)*'Other Graphs'!$A$12)/(M402*SQRT('Other Graphs'!$A$12))","v":0.74939133730701868},{"$f":"O402-M402*SQRT('Other Graphs'!$A$12)","v":-0.59294803855886213},0.77318931467174834,0.2766079636753298,57.318188229189055]
[null,null,null,0.78000000000000058,{"$f":"IF($C$4, 'Other Graphs'!$A$6*H403-EXP(-1*'Other Graphs'!$A$12*D403)*'Other Graphs'!$A$9*I403,-1*'Other Graphs'!$A$6*H403+EXP(-1*'Other Graphs'!$A$12*D403)*'Other Graphs'!$A$9*I403)","v":99.403959794657624},{"$f":"(LN('Other Graphs'!$A$6/'Other Graphs'!$A$9)+(D403+0.5*'Other Graphs'!$A$15^2)*'Other Graphs'!$A$12)/('Other Graphs'!$A$15*SQRT('Other Graphs'!$A$12))","v":6.9282032302755141},{"$f":"F403-'Other Graphs'!$A$15*SQRT('Other Graphs'!$A$12)","v":6.5817930687617388},0.99999999999786893,0.99999999997675959,31.550897308500197,null,null,0.78000000000000058,{"$f":"IF($C$4, 'Other Graphs'!$A$6*Q403-EXP(-1*'Other Graphs'!$A$12*'Other Graphs'!$A$3)*'Other Graphs'!$A$9*R403,-1*'Other Graphs'!$A$6*Q403+EXP(-1*'Other Graphs'!$A$12*'Other Graphs'!$A$3)*'Other Graphs'!$A$9*R403)","v":57.943352942687717},{"$f":"(LN('Other Graphs'!$A$6/'Other Graphs'!$A$9)+('Other Graphs'!$A$3+0.5*M403^2)*'Other Graphs'!$A$12)/(M403*SQRT('Other Graphs'!$A$12))","v":0.75322004349662008},{"$f":"O403-M403*SQRT('Other Graphs'!$A$12)","v":-0.59777958640710516},0.77434115162333406,0.2749935066610138,57.152990807799092]
[null,null,null,0.78500000000000059,{"$f":"IF($C$4, 'Other Graphs'!$A$6*H404-EXP(-1*'Other Graphs'!$A$12*D404)*'Other Graphs'!$A$9*I404,-1*'Other Graphs'!$A$6*H404+EXP(-1*'Other Graphs'!$A$12*D404)*'Other Graphs'!$A$9*I404)","v":99.561714281200125},{"$f":"(LN('Other Graphs'!$A$6/'Other Graphs'!$A$9)+(D404+0.5*'Other Graphs'!$A$15^2)*'Other Graphs'!$A$12)/('Other Graphs'!$A$15*SQRT('Other Graphs'!$A$12))","v":6.9715045004647367},{"$f":"F404-'Other Graphs'!$A$15*SQRT('Other Graphs'!$A$12)","v":6.6250943389509613},0.99999999999843214,0.99999999998264866,31.081165643956837,null,null,0.78500000000000059,{"$f":"IF($C$4, 'Other Graphs'!$A$6*Q404-EXP(-1*'Other Graphs'!$A$12*'Other Graphs'!$A$3)*'Other Graphs'!$A$9*R404,-1*'Other Graphs'!$A$6*Q404+EXP(-1*'Other Graphs'!$A$12*'Other Graphs'!$A$3)*'Other Graphs'!$A$9*R404)","v":58.229117896726713},{"$f":"(LN('Other Graphs'!$A$6/'Other Graphs'!$A$9)+('Other Graphs'!$A$3+0.5*M404^2)*'Other Graphs'!$A$12)/(M404*SQRT('Other Graphs'!$A$12))","v":0.75705513721270923},{"$f":"O404-M404*SQRT('Other Graphs'!$A$12)","v":-0.60260474672886044},0.77549158495875536,0.27338583093209201,56.987159086425216]
[null,null,null,0.79000000000000059,{"$f":"IF($C$4, 'Other Graphs'!$A$6*H405-EXP(-1*'Other Graphs'!$A$12*D405)*'Other Graphs'!$A$9*I405,-1*'Other Graphs'!$A$6*H405+EXP(-1*'Other Graphs'!$A$12*D405)*'Other Graphs'!$A$9*I405)","v":99.717120109419909},{"$f":"(LN('Other Graphs'!$A$6/'Other Graphs'!$A$9)+(D405+0.5*'Other Graphs'!$A$15^2)*'Other Graphs'!$A$12)/('Other Graphs'!$A$15*SQRT('Other Graphs'!$A$12))","v":7.0148057706539584},{"$f":"F405-'Other Graphs'!$A$15*SQRT('Other Graphs'!$A$12)","v":6.668395609140183},0.9999999999988487,0.99999999998706923,30.618427372758077,null,null,0.79000000000000059,{"$f":"IF($C$4, 'Other Graphs'!$A$6*Q405-EXP(-1*'Other Graphs'!$A$12*'Other Graphs'!$A$3)*'Other Graphs'!$A$9*R405,-1*'Other Graphs'!$A$6*Q405+EXP(-1*'Other Graphs'!$A$12*'Other Graphs'!$A$3)*'Other Graphs'!$A$9*R405)","v":58.514053692158839},{"$f":"(LN('Other Graphs'!$A$6/'Other Graphs'!$A$9)+('Other Graphs'!$A$3+0.5*M405^2)*'Other Graphs'!$A$12)/(M405*SQRT('Other Graphs'!$A$12))","v":0.76089649717313834},{"$f":"O405-M405*SQRT('Other Graphs'!$A$12)","v":-0.60742364080627576},0.77664055453592085,0.27178490171191094,56.820702409603946]
[null,null,null,0.7950000000000006,{"$f":"IF($C$4, 'Other Graphs'!$A$6*H406-EXP(-1*'Other Graphs'!$A$12*D406)*'Other Graphs'!$A$9*I406,-1*'Other Graphs'!$A$6*H406+EXP(-1*'Other Graphs'!$A$12*D406)*'Other Graphs'!$A$9*I406)","v":99.8702122462837},{"$f":"(LN('Other Graphs'!$A$6/'Other Graphs'!$A$9)+(D406+0.5*'Other Graphs'!$A$15^2)*'Other Graphs'!$A$12)/('Other Graphs'!$A$15*SQRT('Other Graphs'!$A$12))","v":7.058107040843181},{"$f":"F406-'Other Graphs'!$A$15*SQRT('Other Graphs'!$A$12)","v":6.7116968793294056},0.99999999999915612,0.99999999999038125,30.162578376857113,null,null,0.7950000000000006,{"$f":"IF($C$4, 'Other Graphs'!$A$6*Q406-EXP(-1*'Other Graphs'!$A$12*'Other Graphs'!$A$3)*'Other Graphs'!$A$9*R406,-1*'Other Graphs'!$A$6*Q406+EXP(-1*'Other Graphs'!$A$12*'Other Graphs'!$A$3)*'Other Graphs'!$A$9*R406)","v":58.798157204206859},{"$f":"(LN('Other Graphs'!$A$6/'Other Graphs'!$A$9)+('Other Graphs'!$A$3+0.5*M406^2)*'Other Graphs'!$A$12)/(M406*SQRT('Other Graphs'!$A$12))","v":0.7647440051468819},{"$f":"O406-M406*SQRT('Other Graphs'!$A$12)","v":-0.6122363868703764},0.77778800156549133,0.27019068525455736,56.653630089134261]
[null,null,null,0.8000000000000006,{"$f":"IF($C$4, 'Other Graphs'!$A$6*H407-EXP(-1*'Other Graphs'!$A$12*D407)*'Other Graphs'!$A$9*I407,-1*'Other Graphs'!$A$6*H407+EXP(-1*'Other Graphs'!$A$12*D407)*'Other Graphs'!$A$9*I407)","v":100.02102513816799},{"$f":"(LN('Other Graphs'!$A$6/'Other Graphs'!$A$9)+(D407+0.5*'Other Graphs'!$A$15^2)*'Other Graphs'!$A$12)/('Other Graphs'!$A$15*SQRT('Other Graphs'!$A$12))","v":7.1014083110324018},{"$f":"F407-'Other Graphs'!$A$15*SQRT('Other Graphs'!$A$12)","v":6.7549981495186264},0.99999999999938249,0.99999999999285816,29.713516088321487,null,null,0.8000000000000006,{"$f":"IF($C$4, 'Other Graphs'!$A$6*Q407-EXP(-1*'Other Graphs'!$A$12*'Other Graphs'!$A$3)*'Other Graphs'!$A$9*R407,-1*'Other Graphs'!$A$6*Q407+EXP(-1*'Other Graphs'!$A$12*'Other Graphs'!$A$3)*'Other Graphs'!$A$9*R407)","v":59.081425354652531},{"$f":"(LN('Other Graphs'!$A$6/'Other Graphs'!$A$9)+('Other Graphs'!$A$3+0.5*M407^2)*'Other Graphs'!$A$12)/(M407*SQRT('Other Graphs'!$A$12))","v":0.76859754585869},{"$f":"O407-M407*SQRT('Other Graphs'!$A$12)","v":-0.61704310019641273},0.77893386857476776,0.26860314880640046,56.485951405031138]
[null,null,null,0.8050000000000006,{"$f":"IF($C$4, 'Other Graphs'!$A$6*H408-EXP(-1*'Other Graphs'!$A$12*D408)*'Other Graphs'!$A$9*I408,-1*'Other Graphs'!$A$6*H408+EXP(-1*'Other Graphs'!$A$12*D408)*'Other Graphs'!$A$9*I408)","v":100.16959271860959},{"$f":"(LN('Other Graphs'!$A$6/'Other Graphs'!$A$9)+(D408+0.5*'Other Graphs'!$A$15^2)*'Other Graphs'!$A$12)/('Other Graphs'!$A$15*SQRT('Other Graphs'!$A$12))","v":7.1447095812216244},{"$f":"F408-'Other Graphs'!$A$15*SQRT('Other Graphs'!$A$12)","v":6.798299419707849},0.99999999999954903,0.9999999999947069,29.271139466240445,null,null,0.8050000000000006,{"$f":"IF($C$4, 'Other Graphs'!$A$6*Q408-EXP(-1*'Other Graphs'!$A$12*'Other Graphs'!$A$3)*'Other Graphs'!$A$9*R408,-1*'Other Graphs'!$A$6*Q408+EXP(-1*'Other Graphs'!$A$12*'Other Graphs'!$A$3)*'Other Graphs'!$A$9*R408)","v":59.363855111677687},{"$f":"(LN('Other Graphs'!$A$6/'Other Graphs'!$A$9)+('Other Graphs'!$A$3+0.5*M408^2)*'Other Graphs'!$A$12)/(M408*SQRT('Other Graphs'!$A$12))","v":0.77245700689729457},{"$f":"O408-M408*SQRT('Other Graphs'!$A$12)","v":-0.62184389319565259},0.78007809937291051,0.26702226056906586,56.317675606329892]
[null,null,null,0.81000000000000061,{"$f":"IF($C$4, 'Other Graphs'!$A$6*H409-EXP(-1*'Other Graphs'!$A$12*D409)*'Other Graphs'!$A$9*I409,-1*'Other Graphs'!$A$6*H409+EXP(-1*'Other Graphs'!$A$12*D409)*'Other Graphs'!$A$9*I409)","v":100.3159484159408},{"$f":"(LN('Other Graphs'!$A$6/'Other Graphs'!$A$9)+(D409+0.5*'Other Graphs'!$A$15^2)*'Other Graphs'!$A$12)/('Other Graphs'!$A$15*SQRT('Other Graphs'!$A$12))","v":7.1880108514108461},{"$f":"F409-'Other Graphs'!$A$15*SQRT('Other Graphs'!$A$12)","v":6.8416006898970707},0.99999999999967126,0.99999999999608435,28.835348974016004,null,null,0.81000000000000061,{"$f":"IF($C$4, 'Other Graphs'!$A$6*Q409-EXP(-1*'Other Graphs'!$A$12*'Other Graphs'!$A$3)*'Other Graphs'!$A$9*R409,-1*'Other Graphs'!$A$6*Q409+EXP(-1*'Other Graphs'!$A$12*'Other Graphs'!$A$3)*'Other Graphs'!$A$9*R409)","v":59.645443489709336},{"$f":"(LN('Other Graphs'!$A$6/'Other Graphs'!$A$9)+('Other Graphs'!$A$3+0.5*M409^2)*'Other Graphs'!$A$12)/(M409*SQRT('Other Graphs'!$A$12))","v":0.77632227862701408},{"$f":"O409-M409*SQRT('Other Graphs'!$A$12)","v":-0.6266388755037775},0.78122063901742844,0.26544798966377858,56.148811911881985]
[null,null,null,0.81500000000000061,{"$f":"IF($C$4, 'Other Graphs'!$A$6*H410-EXP(-1*'Other Graphs'!$A$12*D410)*'Other Graphs'!$A$9*I410,-1*'Other Graphs'!$A$6*H410+EXP(-1*'Other Graphs'!$A$12*D410)*'Other Graphs'!$A$9*I410)","v":100.46012516081088},{"$f":"(LN('Other Graphs'!$A$6/'Other Graphs'!$A$9)+(D410+0.5*'Other Graphs'!$A$15^2)*'Other Graphs'!$A$12)/('Other Graphs'!$A$15*SQRT('Other Graphs'!$A$12))","v":7.2313121216000678},{"$f":"F410-'Other Graphs'!$A$15*SQRT('Other Graphs'!$A$12)","v":6.8849019600862924},0.99999999999976086,0.99999999999710865,28.406046556943895,null,null,0.81500000000000061,{"$f":"IF($C$4, 'Other Graphs'!$A$6*Q410-EXP(-1*'Other Graphs'!$A$12*'Other Graphs'!$A$3)*'Other Graphs'!$A$9*R410,-1*'Other Graphs'!$A$6*Q410+EXP(-1*'Other Graphs'!$A$12*'Other Graphs'!$A$3)*'Other Graphs'!$A$9*R410)","v":59.926187549268747},{"$f":"(LN('Other Graphs'!$A$6/'Other Graphs'!$A$9)+('Other Graphs'!$A$3+0.5*M410^2)*'Other Graphs'!$A$12)/(M410*SQRT('Other Graphs'!$A$12))","v":0.78019325410261331},{"$f":"O410-M410*SQRT('Other Graphs'!$A$12)","v":-0.63142815406602271},0.78236143378188772,0.26388030609702018,55.979369511089722]
[null,null,null,0.82000000000000062,{"$f":"IF($C$4, 'Other Graphs'!$A$6*H411-EXP(-1*'Other Graphs'!$A$12*D411)*'Other Graphs'!$A$9*I411,-1*'Other Graphs'!$A$6*H411+EXP(-1*'Other Graphs'!$A$12*D411)*'Other Graphs'!$A$9*I411)","v":100.6021553935956},{"$f":"(LN('Other Graphs'!$A$6/'Other Graphs'!$A$9)+(D411+0.5*'Other Graphs'!$A$15^2)*'Other Graphs'!$A$12)/('Other Graphs'!$A$15*SQRT('Other Graphs'!$A$12))","v":7.2746133917892895},{"$f":"F411-'Other Graphs'!$A$15*SQRT('Other Graphs'!$A$12)","v":6.9282032302755141},0.99999999999982625,0.99999999999786893,27.983135620186747,null,null,0.82000000000000062,{"$f":"IF($C$4, 'Other Graphs'!$A$6*Q411-EXP(-1*'Other Graphs'!$A$12*'Other Graphs'!$A$3)*'Other Graphs'!$A$9*R411,-1*'Other Graphs'!$A$6*Q411+EXP(-1*'Other Graphs'!$A$12*'Other Graphs'!$A$3)*'Other Graphs'!$A$9*R411)","v":60.206084396824195},{"$f":"(LN('Other Graphs'!$A$6/'Other Graphs'!$A$9)+('Other Graphs'!$A$3+0.5*M411^2)*'Other Graphs'!$A$12)/(M411*SQRT('Other Graphs'!$A$12))","v":0.78406982898727773},{"$f":"O411-M411*SQRT('Other Graphs'!$A$12)","v":-0.63621183321920272},0.7835004311247844,0.26231918072744292,55.809357564537216]
[null,null,null,0.82500000000000062,{"$f":"IF($C$4, 'Other Graphs'!$A$6*H412-EXP(-1*'Other Graphs'!$A$12*D412)*'Other Graphs'!$A$9*I412,-1*'Other Graphs'!$A$6*H412+EXP(-1*'Other Graphs'!$A$12*D412)*'Other Graphs'!$A$9*I412)","v":100.74207107169653},{"$f":"(LN('Other Graphs'!$A$6/'Other Graphs'!$A$9)+(D412+0.5*'Other Graphs'!$A$15^2)*'Other Graphs'!$A$12)/('Other Graphs'!$A$15*SQRT('Other Graphs'!$A$12))","v":7.317914661978512},{"$f":"F412-'Other Graphs'!$A$15*SQRT('Other Graphs'!$A$12)","v":6.9715045004647367},0.9999999999998741,0.99999999999843214,27.566521006991682,null,null,0.82500000000000062,{"$f":"IF($C$4, 'Other Graphs'!$A$6*Q412-EXP(-1*'Other Graphs'!$A$12*'Other Graphs'!$A$3)*'Other Graphs'!$A$9*R412,-1*'Other Graphs'!$A$6*Q412+EXP(-1*'Other Graphs'!$A$12*'Other Graphs'!$A$3)*'Other Graphs'!$A$9*R412)","v":60.485131184646882},{"$f":"(LN('Other Graphs'!$A$6/'Other Graphs'!$A$9)+('Other Graphs'!$A$3+0.5*M412^2)*'Other Graphs'!$A$12)/(M412*SQRT('Other Graphs'!$A$12))","v":0.7879519014735693},{"$f":"O412-M412*SQRT('Other Graphs'!$A$12)","v":-0.64099001477075535},0.78463757965953229,0.26076458523398927,55.638785204646929]
[null,null,null,0.83000000000000063,{"$f":"IF($C$4, 'Other Graphs'!$A$6*H413-EXP(-1*'Other Graphs'!$A$12*D413)*'Other Graphs'!$A$9*I413,-1*'Other Graphs'!$A$6*H413+EXP(-1*'Other Graphs'!$A$12*D413)*'Other Graphs'!$A$9*I413)","v":100.87990367673149},{"$f":"(LN('Other Graphs'!$A$6/'Other Graphs'!$A$9)+(D413+0.5*'Other Graphs'!$A$15^2)*'Other Graphs'!$A$12)/('Other Graphs'!$A$15*SQRT('Other Graphs'!$A$12))","v":7.3612159321677346},{"$f":"F413-'Other Graphs'!$A$15*SQRT('Other Graphs'!$A$12)","v":7.0148057706539593},0.99999999999990885,0.9999999999988487,27.156108977317192,null,null,0.83000000000000063,{"$f":"IF($C$4, 'Other Graphs'!$A$6*Q413-EXP(-1*'Other Graphs'!$A$12*'Other Graphs'!$A$3)*'Other Graphs'!$A$9*R413,-1*'Other Graphs'!$A$6*Q413+EXP(-1*'Other Graphs'!$A$12*'Other Graphs'!$A$3)*'Other Graphs'!$A$9*R413)","v":60.763325110670117},{"$f":"(LN('Other Graphs'!$A$6/'Other Graphs'!$A$9)+('Other Graphs'!$A$3+0.5*M413^2)*'Other Graphs'!$A$12)/(M413*SQRT('Other Graphs'!$A$12))","v":0.7918393722072421},{"$f":"O413-M413*SQRT('Other Graphs'!$A$12)","v":-0.64576279807492698},0.7857728291255206,0.25921649208516756,55.467661536205476]
[null,null,null,0.83500000000000063,{"$f":"IF($C$4, 'Other Graphs'!$A$6*H414-EXP(-1*'Other Graphs'!$A$12*D414)*'Other Graphs'!$A$9*I414,-1*'Other Graphs'!$A$6*H414+EXP(-1*'Other Graphs'!$A$12*D414)*'Other Graphs'!$A$9*I414)","v":101.01568422161807},{"$f":"(LN('Other Graphs'!$A$6/'Other Graphs'!$A$9)+(D414+0.5*'Other Graphs'!$A$15^2)*'Other Graphs'!$A$12)/('Other Graphs'!$A$15*SQRT('Other Graphs'!$A$12))","v":7.4045172023569563},{"$f":"F414-'Other Graphs'!$A$15*SQRT('Other Graphs'!$A$12)","v":7.058107040843181},0.99999999999993416,0.99999999999915612,26.751807186724339,null,null,0.83500000000000063,{"$f":"IF($C$4, 'Other Graphs'!$A$6*Q414-EXP(-1*'Other Graphs'!$A$12*'Other Graphs'!$A$3)*'Other Graphs'!$A$9*R414,-1*'Other Graphs'!$A$6*Q414+EXP(-1*'Other Graphs'!$A$12*'Other Graphs'!$A$3)*'Other Graphs'!$A$9*R414)","v":61.040663418351144},{"$f":"(LN('Other Graphs'!$A$6/'Other Graphs'!$A$9)+('Other Graphs'!$A$3+0.5*M414^2)*'Other Graphs'!$A$12)/(M414*SQRT('Other Graphs'!$A$12))","v":0.79573214421379224},{"$f":"O414-M414*SQRT('Other Graphs'!$A$12)","v":-0.65053028010622127},0.78690613036019352,0.2576748745094351,55.295995636890844]
[null,null,null,0.84000000000000064,{"$f":"IF($C$4, 'Other Graphs'!$A$6*H415-EXP(-1*'Other Graphs'!$A$12*D415)*'Other Graphs'!$A$9*I415,-1*'Other Graphs'!$A$6*H415+EXP(-1*'Other Graphs'!$A$12*D415)*'Other Graphs'!$A$9*I415)","v":101.1494432575517},{"$f":"(LN('Other Graphs'!$A$6/'Other Graphs'!$A$9)+(D415+0.5*'Other Graphs'!$A$15^2)*'Other Graphs'!$A$12)/('Other Graphs'!$A$15*SQRT('Other Graphs'!$A$12))","v":7.447818472546178},{"$f":"F415-'Other Graphs'!$A$15*SQRT('Other Graphs'!$A$12)","v":7.1014083110324027},0.99999999999995259,0.99999999999938249,26.35352466560332,null,null,0.84000000000000064,{"$f":"IF($C$4, 'Other Graphs'!$A$6*Q415-EXP(-1*'Other Graphs'!$A$12*'Other Graphs'!$A$3)*'Other Graphs'!$A$9*R415,-1*'Other Graphs'!$A$6*Q415+EXP(-1*'Other Graphs'!$A$12*'Other Graphs'!$A$3)*'Other Graphs'!$A$9*R415)","v":61.317143396535599},{"$f":"(LN('Other Graphs'!$A$6/'Other Graphs'!$A$9)+('Other Graphs'!$A$3+0.5*M415^2)*'Other Graphs'!$A$12)/(M415*SQRT('Other Graphs'!$A$12))","v":0.79963012282763235},{"$f":"O415-M415*SQRT('Other Graphs'!$A$12)","v":-0.65529255553022558},0.78803743527211023,0.25613970646664508,55.123796557752719]
[null,null,null,0.84500000000000064,{"$f":"IF($C$4, 'Other Graphs'!$A$6*H416-EXP(-1*'Other Graphs'!$A$12*D416)*'Other Graphs'!$A$9*I416,-1*'Other Graphs'!$A$6*H416+EXP(-1*'Other Graphs'!$A$12*D416)*'Other Graphs'!$A$9*I416)","v":101.28121088087971},{"$f":"(LN('Other Graphs'!$A$6/'Other Graphs'!$A$9)+(D416+0.5*'Other Graphs'!$A$15^2)*'Other Graphs'!$A$12)/('Other Graphs'!$A$15*SQRT('Other Graphs'!$A$12))","v":7.4911197427353997},{"$f":"F416-'Other Graphs'!$A$15*SQRT('Other Graphs'!$A$12)","v":7.1447095812216244},0.99999999999996581,0.99999999999954903,25.961171798715533,null,null,0.84500000000000064,{"$f":"IF($C$4, 'Other Graphs'!$A$6*Q416-EXP(-1*'Other Graphs'!$A$12*'Other Graphs'!$A$3)*'Other Graphs'!$A$9*R416,-1*'Other Graphs'!$A$6*Q416+EXP(-1*'Other Graphs'!$A$12*'Other Graphs'!$A$3)*'Other Graphs'!$A$9*R416)","v":61.592762379324363},{"$f":"(LN('Other Graphs'!$A$6/'Other Graphs'!$A$9)+('Other Graphs'!$A$3+0.5*M416^2)*'Other Graphs'!$A$12)/(M416*SQRT('Other Graphs'!$A$12))","v":0.80353321562378099},{"$f":"O416-M416*SQRT('Other Graphs'!$A$12)","v":-0.66004971677192137},0.78916669681494533,0.25461096262051208,54.95107332364308]
[null,null,null,0.85000000000000064,{"$f":"IF($C$4, 'Other Graphs'!$A$6*H417-EXP(-1*'Other Graphs'!$A$12*D417)*'Other Graphs'!$A$9*I417,-1*'Other Graphs'!$A$6*H417+EXP(-1*'Other Graphs'!$A$12*D417)*'Other Graphs'!$A$9*I417)","v":101.41101673987329},{"$f":"(LN('Other Graphs'!$A$6/'Other Graphs'!$A$9)+(D417+0.5*'Other Graphs'!$A$15^2)*'Other Graphs'!$A$12)/('Other Graphs'!$A$15*SQRT('Other Graphs'!$A$12))","v":7.5344210129246223},{"$f":"F417-'Other Graphs'!$A$15*SQRT('Other Graphs'!$A$12)","v":7.1880108514108469},0.99999999999997546,0.99999999999967126,25.574660305005615,null,null,0.85000000000000064,{"$f":"IF($C$4, 'Other Graphs'!$A$6*Q417-EXP(-1*'Other Graphs'!$A$12*'Other Graphs'!$A$3)*'Other Graphs'!$A$9*R417,-1*'Other Graphs'!$A$6*Q417+EXP(-1*'Other Graphs'!$A$12*'Other Graphs'!$A$3)*'Other Graphs'!$A$9*R417)","v":61.867517745942578},{"$f":"(LN('Other Graphs'!$A$6/'Other Graphs'!$A$9)+('Other Graphs'!$A$3+0.5*M417^2)*'Other Graphs'!$A$12)/(M417*SQRT('Other Graphs'!$A$12))","v":0.80744133235196236},{"$f":"O417-M417*SQRT('Other Graphs'!$A$12)","v":-0.66480185408158443},0.79029386896238951,0.25308861831205731,54.777834933574304]
[null,null,null,0.85500000000000065,{"$f":"IF($C$4, 'Other Graphs'!$A$6*H418-EXP(-1*'Other Graphs'!$A$12*D418)*'Other Graphs'!$A$9*I418,-1*'Other Graphs'!$A$6*H418+EXP(-1*'Other Graphs'!$A$12*D418)*'Other Graphs'!$A$9*I418)","v":101.53889004139832},{"$f":"(LN('Other Graphs'!$A$6/'Other Graphs'!$A$9)+(D418+0.5*'Other Graphs'!$A$15^2)*'Other Graphs'!$A$12)/('Other Graphs'!$A$15*SQRT('Other Graphs'!$A$12))","v":7.5777222831138431},{"$f":"F418-'Other Graphs'!$A$15*SQRT('Other Graphs'!$A$12)","v":7.2313121216000678},0.99999999999998246,0.99999999999976086,25.193903217751746,null,null,0.85500000000000065,{"$f":"IF($C$4, 'Other Graphs'!$A$6*Q418-EXP(-1*'Other Graphs'!$A$12*'Other Graphs'!$A$3)*'Other Graphs'!$A$9*R418,-1*'Other Graphs'!$A$6*Q418+EXP(-1*'Other Graphs'!$A$12*'Other Graphs'!$A$3)*'Other Graphs'!$A$9*R418)","v":62.14140692061045},{"$f":"(LN('Other Graphs'!$A$6/'Other Graphs'!$A$9)+('Other Graphs'!$A$3+0.5*M418^2)*'Other Graphs'!$A$12)/(M418*SQRT('Other Graphs'!$A$12))","v":0.81135438487301814},{"$f":"O418-M418*SQRT('Other Graphs'!$A$12)","v":-0.66954905559837308},0.79141890668391257,0.25157264953399272,54.604090361085817]
[null,null,null,0.86000000000000065,{"$f":"IF($C$4, 'Other Graphs'!$A$6*H419-EXP(-1*'Other Graphs'!$A$12*D419)*'Other Graphs'!$A$9*I419,-1*'Other Graphs'!$A$6*H419+EXP(-1*'Other Graphs'!$A$12*D419)*'Other Graphs'!$A$9*I419)","v":101.66485955748708},{"$f":"(LN('Other Graphs'!$A$6/'Other Graphs'!$A$9)+(D419+0.5*'Other Graphs'!$A$15^2)*'Other Graphs'!$A$12)/('Other Graphs'!$A$15*SQRT('Other Graphs'!$A$12))","v":7.6210235533030657},{"$f":"F419-'Other Graphs'!$A$15*SQRT('Other Graphs'!$A$12)","v":7.2746133917892903},0.99999999999998745,0.99999999999982625,24.818814865011497,null,null,0.86000000000000065,{"$f":"IF($C$4, 'Other Graphs'!$A$6*Q419-EXP(-1*'Other Graphs'!$A$12*'Other Graphs'!$A$3)*'Other Graphs'!$A$9*R419,-1*'Other Graphs'!$A$6*Q419+EXP(-1*'Other Graphs'!$A$12*'Other Graphs'!$A$3)*'Other Graphs'!$A$9*R419)","v":62.414427372415879},{"$f":"(LN('Other Graphs'!$A$6/'Other Graphs'!$A$9)+('Other Graphs'!$A$3+0.5*M419^2)*'Other Graphs'!$A$12)/(M419*SQRT('Other Graphs'!$A$12))","v":0.8152722870975373},{"$f":"O419-M419*SQRT('Other Graphs'!$A$12)","v":-0.67429140741169813},0.7925417659213555,0.2500630329060074,54.429848554589405]
[null,null,null,0.86500000000000066,{"$f":"IF($C$4, 'Other Graphs'!$A$6*H420-EXP(-1*'Other Graphs'!$A$12*D420)*'Other Graphs'!$A$9*I420,-1*'Other Graphs'!$A$6*H420+EXP(-1*'Other Graphs'!$A$12*D420)*'Other Graphs'!$A$9*I420)","v":101.78895363181213},{"$f":"(LN('Other Graphs'!$A$6/'Other Graphs'!$A$9)+(D420+0.5*'Other Graphs'!$A$15^2)*'Other Graphs'!$A$12)/('Other Graphs'!$A$15*SQRT('Other Graphs'!$A$12))","v":7.6643248234922874},{"$f":"F420-'Other Graphs'!$A$15*SQRT('Other Graphs'!$A$12)","v":7.317914661978512},0.99999999999999101,0.9999999999998741,24.449310850326334,null,null,0.86500000000000066,{"$f":"IF($C$4, 'Other Graphs'!$A$6*Q420-EXP(-1*'Other Graphs'!$A$12*'Other Graphs'!$A$3)*'Other Graphs'!$A$9*R420,-1*'Other Graphs'!$A$6*Q420+EXP(-1*'Other Graphs'!$A$12*'Other Graphs'!$A$3)*'Other Graphs'!$A$9*R420)","v":62.686576615188827},{"$f":"(LN('Other Graphs'!$A$6/'Other Graphs'!$A$9)+('Other Graphs'!$A$3+0.5*M420^2)*'Other Graphs'!$A$12)/(M420*SQRT('Other Graphs'!$A$12))","v":0.81919495492661598},{"$f":"O420-M420*SQRT('Other Graphs'!$A$12)","v":-0.67902899362046387},0.79366240356631734,0.24855974565091982,54.255118437552547]
[null,null,null,0.87000000000000066,{"$f":"IF($C$4, 'Other Graphs'!$A$6*H421-EXP(-1*'Other Graphs'!$A$12*D421)*'Other Graphs'!$A$9*I421,-1*'Other Graphs'!$A$6*H421+EXP(-1*'Other Graphs'!$A$12*D421)*'Other Graphs'!$A$9*I421)","v":101.91120018606377},{"$f":"(LN('Other Graphs'!$A$6/'Other Graphs'!$A$9)+(D421+0.5*'Other Graphs'!$A$15^2)*'Other Graphs'!$A$12)/('Other Graphs'!$A$15*SQRT('Other Graphs'!$A$12))","v":7.70762609368151},{"$f":"F421-'Other Graphs'!$A$15*SQRT('Other Graphs'!$A$12)","v":7.3612159321677346},0.99999999999999356,0.99999999999990885,24.085308033721709,null,null,0.87000000000000066,{"$f":"IF($C$4, 'Other Graphs'!$A$6*Q421-EXP(-1*'Other Graphs'!$A$12*'Other Graphs'!$A$3)*'Other Graphs'!$A$9*R421,-1*'Other Graphs'!$A$6*Q421+EXP(-1*'Other Graphs'!$A$12*'Other Graphs'!$A$3)*'Other Graphs'!$A$9*R421)","v":62.95785220737659},{"$f":"(LN('Other Graphs'!$A$6/'Other Graphs'!$A$9)+('Other Graphs'!$A$3+0.5*M421^2)*'Other Graphs'!$A$12)/(M421*SQRT('Other Graphs'!$A$12))","v":0.82312230619465832},{"$f":"O421-M421*SQRT('Other Graphs'!$A$12)","v":-0.68376189639026597},0.79478077743830189,0.24706276557166423,54.079908908855096]
[null,null,null,0.87500000000000067,{"$f":"IF($C$4, 'Other Graphs'!$A$6*H422-EXP(-1*'Other Graphs'!$A$12*D422)*'Other Graphs'!$A$9*I422,-1*'Other Graphs'!$A$6*H422+EXP(-1*'Other Graphs'!$A$12*D422)*'Other Graphs'!$A$9*I422)","v":102.03162672623237},{"$f":"(LN('Other Graphs'!$A$6/'Other Graphs'!$A$9)+(D422+0.5*'Other Graphs'!$A$15^2)*'Other Graphs'!$A$12)/('Other Graphs'!$A$15*SQRT('Other Graphs'!$A$12))","v":7.7509273638707326},{"$f":"F422-'Other Graphs'!$A$15*SQRT('Other Graphs'!$A$12)","v":7.4045172023569572},0.99999999999999545,0.99999999999993416,23.726724513036835,null,null,0.87500000000000067,{"$f":"IF($C$4, 'Other Graphs'!$A$6*Q422-EXP(-1*'Other Graphs'!$A$12*'Other Graphs'!$A$3)*'Other Graphs'!$A$9*R422,-1*'Other Graphs'!$A$6*Q422+EXP(-1*'Other Graphs'!$A$12*'Other Graphs'!$A$3)*'Other Graphs'!$A$9*R422)","v":63.228251751920865},{"$f":"(LN('Other Graphs'!$A$6/'Other Graphs'!$A$9)+('Other Graphs'!$A$3+0.5*M422^2)*'Other Graphs'!$A$12)/(M422*SQRT('Other Graphs'!$A$12))","v":0.82705426061413945},{"$f":"O422-M422*SQRT('Other Graphs'!$A$12)","v":-0.68849019600862926},0.79589684626359802,0.24557207102907441,53.904228842920027]
[null,null,null,0.88000000000000067,{"$f":"IF($C$4, 'Other Graphs'!$A$6*H423-EXP(-1*'Other Graphs'!$A$12*D423)*'Other Graphs'!$A$9*I423,-1*'Other Graphs'!$A$6*H423+EXP(-1*'Other Graphs'!$A$12*D423)*'Other Graphs'!$A$9*I423)","v":102.15026034879756},{"$f":"(LN('Other Graphs'!$A$6/'Other Graphs'!$A$9)+(D423+0.5*'Other Graphs'!$A$15^2)*'Other Graphs'!$A$12)/('Other Graphs'!$A$15*SQRT('Other Graphs'!$A$12))","v":7.7942286340599534},{"$f":"F423-'Other Graphs'!$A$15*SQRT('Other Graphs'!$A$12)","v":7.447818472546178},0.99999999999999678,0.99999999999995259,23.373479605467629,null,null,0.88000000000000067,{"$f":"IF($C$4, 'Other Graphs'!$A$6*Q423-EXP(-1*'Other Graphs'!$A$12*'Other Graphs'!$A$3)*'Other Graphs'!$A$9*R423,-1*'Other Graphs'!$A$6*Q423+EXP(-1*'Other Graphs'!$A$12*'Other Graphs'!$A$3)*'Other Graphs'!$A$9*R423)","v":63.497772896135466},{"$f":"(LN('Other Graphs'!$A$6/'Other Graphs'!$A$9)+('Other Graphs'!$A$3+0.5*M423^2)*'Other Graphs'!$A$12)/(M423*SQRT('Other Graphs'!$A$12))","v":0.83099073972225046},{"$f":"O423-M423*SQRT('Other Graphs'!$A$12)","v":-0.69321397093836268},0.79701056965485961,0.24408764092043767,53.728087089909543]
[null,null,null,0.88500000000000068,{"$f":"IF($C$4, 'Other Graphs'!$A$6*H424-EXP(-1*'Other Graphs'!$A$12*D424)*'Other Graphs'!$A$9*I424,-1*'Other Graphs'!$A$6*H424+EXP(-1*'Other Graphs'!$A$12*D424)*'Other Graphs'!$A$9*I424)","v":102.2671277468249},{"$f":"(LN('Other Graphs'!$A$6/'Other Graphs'!$A$9)+(D424+0.5*'Other Graphs'!$A$15^2)*'Other Graphs'!$A$12)/('Other Graphs'!$A$15*SQRT('Other Graphs'!$A$12))","v":7.8375299042491759},{"$f":"F424-'Other Graphs'!$A$15*SQRT('Other Graphs'!$A$12)","v":7.4911197427354006},0.99999999999999767,0.99999999999996581,23.025493829410927,null,null,0.88500000000000068,{"$f":"IF($C$4, 'Other Graphs'!$A$6*Q424-EXP(-1*'Other Graphs'!$A$12*'Other Graphs'!$A$3)*'Other Graphs'!$A$9*R424,-1*'Other Graphs'!$A$6*Q424+EXP(-1*'Other Graphs'!$A$12*'Other Graphs'!$A$3)*'Other Graphs'!$A$9*R424)","v":63.766413331585014},{"$f":"(LN('Other Graphs'!$A$6/'Other Graphs'!$A$9)+('Other Graphs'!$A$3+0.5*M424^2)*'Other Graphs'!$A$12)/(M424*SQRT('Other Graphs'!$A$12))","v":0.83493166682935394},{"$f":"O424-M424*SQRT('Other Graphs'!$A$12)","v":-0.69793329786910363},0.79812190809136041,0.24260945465878803,53.55149247591266]
[null,null,null,0.89000000000000068,{"$f":"IF($C$4, 'Other Graphs'!$A$6*H425-EXP(-1*'Other Graphs'!$A$12*D425)*'Other Graphs'!$A$9*I425,-1*'Other Graphs'!$A$6*H425+EXP(-1*'Other Graphs'!$A$12*D425)*'Other Graphs'!$A$9*I425)","v":102.38225521597195},{"$f":"(LN('Other Graphs'!$A$6/'Other Graphs'!$A$9)+(D425+0.5*'Other Graphs'!$A$15^2)*'Other Graphs'!$A$12)/('Other Graphs'!$A$15*SQRT('Other Graphs'!$A$12))","v":7.8808311744383976},{"$f":"F425-'Other Graphs'!$A$15*SQRT('Other Graphs'!$A$12)","v":7.5344210129246223},0.99999999999999833,0.99999999999997546,22.682688886615644,null,null,0.89000000000000068,{"$f":"IF($C$4, 'Other Graphs'!$A$6*Q425-EXP(-1*'Other Graphs'!$A$12*'Other Graphs'!$A$3)*'Other Graphs'!$A$9*R425,-1*'Other Graphs'!$A$6*Q425+EXP(-1*'Other Graphs'!$A$12*'Other Graphs'!$A$3)*'Other Graphs'!$A$9*R425)","v":64.034170793964577},{"$f":"(LN('Other Graphs'!$A$6/'Other Graphs'!$A$9)+('Other Graphs'!$A$3+0.5*M425^2)*'Other Graphs'!$A$12)/(M425*SQRT('Other Graphs'!$A$12))","v":0.83887696696917424},{"$f":"O425-M425*SQRT('Other Graphs'!$A$12)","v":-0.70264825176712753},0.79923082289989533,0.24113749215290925,53.37445380303047]
[null,null,null,0.89500000000000068,{"$f":"IF($C$4, 'Other Graphs'!$A$6*H426-EXP(-1*'Other Graphs'!$A$12*D426)*'Other Graphs'!$A$9*I426,-1*'Other Graphs'!$A$6*H426+EXP(-1*'Other Graphs'!$A$12*D426)*'Other Graphs'!$A$9*I426)","v":102.49566866040503},{"$f":"(LN('Other Graphs'!$A$6/'Other Graphs'!$A$9)+(D426+0.5*'Other Graphs'!$A$15^2)*'Other Graphs'!$A$12)/('Other Graphs'!$A$15*SQRT('Other Graphs'!$A$12))","v":7.9241324446276193},{"$f":"F426-'Other Graphs'!$A$15*SQRT('Other Graphs'!$A$12)","v":7.577722283113844},0.99999999999999889,0.99999999999998246,22.344987644504478,null,null,0.89500000000000068,{"$f":"IF($C$4, 'Other Graphs'!$A$6*Q426-EXP(-1*'Other Graphs'!$A$12*'Other Graphs'!$A$3)*'Other Graphs'!$A$9*R426,-1*'Other Graphs'!$A$6*Q426+EXP(-1*'Other Graphs'!$A$12*'Other Graphs'!$A$3)*'Other Graphs'!$A$9*R426)","v":64.30104306297973},{"$f":"(LN('Other Graphs'!$A$6/'Other Graphs'!$A$9)+('Other Graphs'!$A$3+0.5*M426^2)*'Other Graphs'!$A$12)/(M426*SQRT('Other Graphs'!$A$12))","v":0.8428265668506606},{"$f":"O426-M426*SQRT('Other Graphs'!$A$12)","v":-0.7073589059234856},0.80033727623630335,0.23967173378802262,53.196979849499776]
[null,null,null,0.90000000000000069,{"$f":"IF($C$4, 'Other Graphs'!$A$6*H427-EXP(-1*'Other Graphs'!$A$12*D427)*'Other Graphs'!$A$9*I427,-1*'Other Graphs'!$A$6*H427+EXP(-1*'Other Graphs'!$A$12*D427)*'Other Graphs'!$A$9*I427)","v":102.60739359862755},{"$f":"(LN('Other Graphs'!$A$6/'Other Graphs'!$A$9)+(D427+0.5*'Other Graphs'!$A$15^2)*'Other Graphs'!$A$12)/('Other Graphs'!$A$15*SQRT('Other Graphs'!$A$12))","v":7.967433714816841},{"$f":"F427-'Other Graphs'!$A$15*SQRT('Other Graphs'!$A$12)","v":7.6210235533030657},0.99999999999999922,0.99999999999998745,22.012314118882138,null,null,0.90000000000000069,{"$f":"IF($C$4, 'Other Graphs'!$A$6*Q427-EXP(-1*'Other Graphs'!$A$12*'Other Graphs'!$A$3)*'Other Graphs'!$A$9*R427,-1*'Other Graphs'!$A$6*Q427+EXP(-1*'Other Graphs'!$A$12*'Other Graphs'!$A$3)*'Other Graphs'!$A$9*R427)","v":64.567027962227229},{"$f":"(LN('Other Graphs'!$A$6/'Other Graphs'!$A$9)+('Other Graphs'!$A$3+0.5*M427^2)*'Other Graphs'!$A$12)/(M427*SQRT('Other Graphs'!$A$12))","v":0.84678039481145173},{"$f":"O427-M427*SQRT('Other Graphs'!$A$12)","v":-0.7120653320005389},0.8014412310675868,0.23821216040713183,53.019079369752781]
[null,null,null,0.90500000000000069,{"$f":"IF($C$4, 'Other Graphs'!$A$6*H428-EXP(-1*'Other Graphs'!$A$12*D428)*'Other Graphs'!$A$9*I428,-1*'Other Graphs'!$A$6*H428+EXP(-1*'Other Graphs'!$A$12*D428)*'Other Graphs'!$A$9*I428)","v":102.71745516922196},{"$f":"(LN('Other Graphs'!$A$6/'Other Graphs'!$A$9)+(D428+0.5*'Other Graphs'!$A$15^2)*'Other Graphs'!$A$12)/('Other Graphs'!$A$15*SQRT('Other Graphs'!$A$12))","v":8.0107349850060636},{"$f":"F428-'Other Graphs'!$A$15*SQRT('Other Graphs'!$A$12)","v":7.6643248234922883},0.99999999999999944,0.99999999999999101,21.684593456805583,null,null,0.90500000000000069,{"$f":"IF($C$4, 'Other Graphs'!$A$6*Q428-EXP(-1*'Other Graphs'!$A$12*'Other Graphs'!$A$3)*'Other Graphs'!$A$9*R428,-1*'Other Graphs'!$A$6*Q428+EXP(-1*'Other Graphs'!$A$12*'Other Graphs'!$A$3)*'Other Graphs'!$A$9*R428)","v":64.832123359075993},{"$f":"(LN('Other Graphs'!$A$6/'Other Graphs'!$A$9)+('Other Graphs'!$A$3+0.5*M428^2)*'Other Graphs'!$A$12)/(M428*SQRT('Other Graphs'!$A$12))","v":0.85073838077288533},{"$f":"O428-M428*SQRT('Other Graphs'!$A$12)","v":-0.71676760007694973},0.80254265115460388,0.23675875329300078,52.840761094483874]
[null,null,null,0.9100000000000007,{"$f":"IF($C$4, 'Other Graphs'!$A$6*H429-EXP(-1*'Other Graphs'!$A$12*D429)*'Other Graphs'!$A$9*I429,-1*'Other Graphs'!$A$6*H429+EXP(-1*'Other Graphs'!$A$12*D429)*'Other Graphs'!$A$9*I429)","v":102.82587813650599},{"$f":"(LN('Other Graphs'!$A$6/'Other Graphs'!$A$9)+(D429+0.5*'Other Graphs'!$A$15^2)*'Other Graphs'!$A$12)/('Other Graphs'!$A$15*SQRT('Other Graphs'!$A$12))","v":8.0540362551952853},{"$f":"F429-'Other Graphs'!$A$15*SQRT('Other Graphs'!$A$12)","v":7.70762609368151},0.99999999999999956,0.99999999999999356,21.361751919732779,null,null,0.9100000000000007,{"$f":"IF($C$4, 'Other Graphs'!$A$6*Q429-EXP(-1*'Other Graphs'!$A$12*'Other Graphs'!$A$3)*'Other Graphs'!$A$9*R429,-1*'Other Graphs'!$A$6*Q429+EXP(-1*'Other Graphs'!$A$12*'Other Graphs'!$A$3)*'Other Graphs'!$A$9*R429)","v":65.096327164548413},{"$f":"(LN('Other Graphs'!$A$6/'Other Graphs'!$A$9)+('Other Graphs'!$A$3+0.5*M429^2)*'Other Graphs'!$A$12)/(M429*SQRT('Other Graphs'!$A$12))","v":0.85470045619648882},{"$f":"O429-M429*SQRT('Other Graphs'!$A$12)","v":-0.72146577869119066},0.80364150103531273,0.2353114941507414,52.662033730675212]
[null,null,null,0.9150000000000007,{"$f":"IF($C$4, 'Other Graphs'!$A$6*H430-EXP(-1*'Other Graphs'!$A$12*D430)*'Other Graphs'!$A$9*I430,-1*'Other Graphs'!$A$6*H430+EXP(-1*'Other Graphs'!$A$12*D430)*'Other Graphs'!$A$9*I430)","v":102.93268689610466},{"$f":"(LN('Other Graphs'!$A$6/'Other Graphs'!$A$9)+(D430+0.5*'Other Graphs'!$A$15^2)*'Other Graphs'!$A$12)/('Other Graphs'!$A$15*SQRT('Other Graphs'!$A$12))","v":8.0973375253845088},{"$f":"F430-'Other Graphs'!$A$15*SQRT('Other Graphs'!$A$12)","v":7.7509273638707334},0.99999999999999967,0.99999999999999545,21.043716866975597,null,null,0.9150000000000007,{"$f":"IF($C$4, 'Other Graphs'!$A$6*Q430-EXP(-1*'Other Graphs'!$A$12*'Other Graphs'!$A$3)*'Other Graphs'!$A$9*R430,-1*'Other Graphs'!$A$6*Q430+EXP(-1*'Other Graphs'!$A$12*'Other Graphs'!$A$3)*'Other Graphs'!$A$9*R430)","v":65.359637333201789},{"$f":"(LN('Other Graphs'!$A$6/'Other Graphs'!$A$9)+('Other Graphs'!$A$3+0.5*M430^2)*'Other Graphs'!$A$12)/(M430*SQRT('Other Graphs'!$A$12))","v":0.85866655404189929},{"$f":"O430-M430*SQRT('Other Graphs'!$A$12)","v":-0.72615993488362462},0.80473774600854431,0.23387036509098738,52.482905961596721]
[null,null,null,0.92000000000000071,{"$f":"IF($C$4, 'Other Graphs'!$A$6*H431-EXP(-1*'Other Graphs'!$A$12*D431)*'Other Graphs'!$A$9*I431,-1*'Other Graphs'!$A$6*H431+EXP(-1*'Other Graphs'!$A$12*D431)*'Other Graphs'!$A$9*I431)","v":103.03790548043953},{"$f":"(LN('Other Graphs'!$A$6/'Other Graphs'!$A$9)+(D431+0.5*'Other Graphs'!$A$15^2)*'Other Graphs'!$A$12)/('Other Graphs'!$A$15*SQRT('Other Graphs'!$A$12))","v":8.1406387955737287},{"$f":"F431-'Other Graphs'!$A$15*SQRT('Other Graphs'!$A$12)","v":7.7942286340599534},0.99999999999999978,0.99999999999999678,20.730416739280582,null,null,0.92000000000000071,{"$f":"IF($C$4, 'Other Graphs'!$A$6*Q431-EXP(-1*'Other Graphs'!$A$12*'Other Graphs'!$A$3)*'Other Graphs'!$A$9*R431,-1*'Other Graphs'!$A$6*Q431+EXP(-1*'Other Graphs'!$A$12*'Other Graphs'!$A$3)*'Other Graphs'!$A$9*R431)","v":65.622051863009773},{"$f":"(LN('Other Graphs'!$A$6/'Other Graphs'!$A$9)+('Other Graphs'!$A$3+0.5*M431^2)*'Other Graphs'!$A$12)/(M431*SQRT('Other Graphs'!$A$12))","v":0.86263660872615222},{"$f":"O431-M431*SQRT('Other Graphs'!$A$12)","v":-0.73085013423721612},0.80583135211828505,0.23243534861363332,52.303386446803252]
[null,null,null,0.92500000000000071,{"$f":"IF($C$4, 'Other Graphs'!$A$6*H432-EXP(-1*'Other Graphs'!$A$12*D432)*'Other Graphs'!$A$9*I432,-1*'Other Graphs'!$A$6*H432+EXP(-1*'Other Graphs'!$A$12*D432)*'Other Graphs'!$A$9*I432)","v":103.14155756413594},{"$f":"(LN('Other Graphs'!$A$6/'Other Graphs'!$A$9)+(D432+0.5*'Other Graphs'!$A$15^2)*'Other Graphs'!$A$12)/('Other Graphs'!$A$15*SQRT('Other Graphs'!$A$12))","v":8.1839400657629522},{"$f":"F432-'Other Graphs'!$A$15*SQRT('Other Graphs'!$A$12)","v":7.8375299042491768},0.99999999999999989,0.99999999999999767,20.421781042813318,null,null,0.92500000000000071,{"$f":"IF($C$4, 'Other Graphs'!$A$6*Q432-EXP(-1*'Other Graphs'!$A$12*'Other Graphs'!$A$3)*'Other Graphs'!$A$9*R432,-1*'Other Graphs'!$A$6*Q432+EXP(-1*'Other Graphs'!$A$12*'Other Graphs'!$A$3)*'Other Graphs'!$A$9*R432)","v":65.883568795243789},{"$f":"(LN('Other Graphs'!$A$6/'Other Graphs'!$A$9)+('Other Graphs'!$A$3+0.5*M432^2)*'Other Graphs'!$A$12)/(M432*SQRT('Other Graphs'!$A$12))","v":0.86661055608429371},{"$f":"O432-M432*SQRT('Other Graphs'!$A$12)","v":-0.73553644091691883},0.80692228613844852,0.23100642759211784,52.12348382212037]
[null,null,null,0.93000000000000071,{"$f":"IF($C$4, 'Other Graphs'!$A$6*H433-EXP(-1*'Other Graphs'!$A$12*D433)*'Other Graphs'!$A$9*I433,-1*'Other Graphs'!$A$6*H433+EXP(-1*'Other Graphs'!$A$12*D433)*'Other Graphs'!$A$9*I433)","v":103.24366646935},{"$f":"(LN('Other Graphs'!$A$6/'Other Graphs'!$A$9)+(D433+0.5*'Other Graphs'!$A$15^2)*'Other Graphs'!$A$12)/('Other Graphs'!$A$15*SQRT('Other Graphs'!$A$12))","v":8.2272413359521739},{"$f":"F433-'Other Graphs'!$A$15*SQRT('Other Graphs'!$A$12)","v":7.8808311744383985},0.99999999999999989,0.99999999999999833,20.117740333230909,null,null,0.93000000000000071,{"$f":"IF($C$4, 'Other Graphs'!$A$6*Q433-EXP(-1*'Other Graphs'!$A$12*'Other Graphs'!$A$3)*'Other Graphs'!$A$9*R433,-1*'Other Graphs'!$A$6*Q433+EXP(-1*'Other Graphs'!$A$12*'Other Graphs'!$A$3)*'Other Graphs'!$A$9*R433)","v":66.144186214354391},{"$f":"(LN('Other Graphs'!$A$6/'Other Graphs'!$A$9)+('Other Graphs'!$A$3+0.5*M433^2)*'Other Graphs'!$A$12)/(M433*SQRT('Other Graphs'!$A$12))","v":0.87058833333126051},{"$f":"O433-M433*SQRT('Other Graphs'!$A$12)","v":-0.74021891770779646},0.80801051555811809,0.22958358525823103,51.943206699550572]
[null,null,null,0.93500000000000072,{"$f":"IF($C$4, 'Other Graphs'!$A$6*H434-EXP(-1*'Other Graphs'!$A$12*D434)*'Other Graphs'!$A$9*I434,-1*'Other Graphs'!$A$6*H434+EXP(-1*'Other Graphs'!$A$12*D434)*'Other Graphs'!$A$9*I434)","v":103.34425517101616},{"$f":"(LN('Other Graphs'!$A$6/'Other Graphs'!$A$9)+(D434+0.5*'Other Graphs'!$A$15^2)*'Other Graphs'!$A$12)/('Other Graphs'!$A$15*SQRT('Other Graphs'!$A$12))","v":8.2705426061413956},{"$f":"F434-'Other Graphs'!$A$15*SQRT('Other Graphs'!$A$12)","v":7.9241324446276202},0.99999999999999989,0.99999999999999889,19.818226200106874,null,null,0.93500000000000072,{"$f":"IF($C$4, 'Other Graphs'!$A$6*Q434-EXP(-1*'Other Graphs'!$A$12*'Other Graphs'!$A$3)*'Other Graphs'!$A$9*R434,-1*'Other Graphs'!$A$6*Q434+EXP(-1*'Other Graphs'!$A$12*'Other Graphs'!$A$3)*'Other Graphs'!$A$9*R434)","v":66.403902247852145},{"$f":"(LN('Other Graphs'!$A$6/'Other Graphs'!$A$9)+('Other Graphs'!$A$3+0.5*M434^2)*'Other Graphs'!$A$12)/(M434*SQRT('Other Graphs'!$A$12))","v":0.8745698790249864},{"$f":"O434-M434*SQRT('Other Graphs'!$A$12)","v":-0.74489762605191501},0.80909600856724206,0.2281668051874278,51.76256366727894]
[null,null,null,0.94000000000000072,{"$f":"IF($C$4, 'Other Graphs'!$A$6*H435-EXP(-1*'Other Graphs'!$A$12*D435)*'Other Graphs'!$A$9*I435,-1*'Other Graphs'!$A$6*H435+EXP(-1*'Other Graphs'!$A$12*D435)*'Other Graphs'!$A$9*I435)","v":103.44334630201669},{"$f":"(LN('Other Graphs'!$A$6/'Other Graphs'!$A$9)+(D435+0.5*'Other Graphs'!$A$15^2)*'Other Graphs'!$A$12)/('Other Graphs'!$A$15*SQRT('Other Graphs'!$A$12))","v":8.3138438763306173},{"$f":"F435-'Other Graphs'!$A$15*SQRT('Other Graphs'!$A$12)","v":7.9674337148168419},1,0.99999999999999922,19.523171251475429,null,null,0.94000000000000072,{"$f":"IF($C$4, 'Other Graphs'!$A$6*Q435-EXP(-1*'Other Graphs'!$A$12*'Other Graphs'!$A$3)*'Other Graphs'!$A$9*R435,-1*'Other Graphs'!$A$6*Q435+EXP(-1*'Other Graphs'!$A$12*'Other Graphs'!$A$3)*'Other Graphs'!$A$9*R435)","v":66.662715066188539},{"$f":"(LN('Other Graphs'!$A$6/'Other Graphs'!$A$9)+('Other Graphs'!$A$3+0.5*M435^2)*'Other Graphs'!$A$12)/(M435*SQRT('Other Graphs'!$A$12))","v":0.87855513303068211},{"$f":"O435-M435*SQRT('Other Graphs'!$A$12)","v":-0.74957262608406372},0.81017873404276475,0.22675607128462694,51.581563289525391]
[null,null,null,0.94500000000000073,{"$f":"IF($C$4, 'Other Graphs'!$A$6*H436-EXP(-1*'Other Graphs'!$A$12*D436)*'Other Graphs'!$A$9*I436,-1*'Other Graphs'!$A$6*H436+EXP(-1*'Other Graphs'!$A$12*D436)*'Other Graphs'!$A$9*I436)","v":103.54096215827407},{"$f":"(LN('Other Graphs'!$A$6/'Other Graphs'!$A$9)+(D436+0.5*'Other Graphs'!$A$15^2)*'Other Graphs'!$A$12)/('Other Graphs'!$A$15*SQRT('Other Graphs'!$A$12))","v":8.357145146519839},{"$f":"F436-'Other Graphs'!$A$15*SQRT('Other Graphs'!$A$12)","v":8.0107349850060636},1,0.99999999999999944,19.232509098742394,null,null,0.94500000000000073,{"$f":"IF($C$4, 'Other Graphs'!$A$6*Q436-EXP(-1*'Other Graphs'!$A$12*'Other Graphs'!$A$3)*'Other Graphs'!$A$9*R436,-1*'Other Graphs'!$A$6*Q436+EXP(-1*'Other Graphs'!$A$12*'Other Graphs'!$A$3)*'Other Graphs'!$A$9*R436)","v":66.920622882636167},{"$f":"(LN('Other Graphs'!$A$6/'Other Graphs'!$A$9)+('Other Graphs'!$A$3+0.5*M436^2)*'Other Graphs'!$A$12)/(M436*SQRT('Other Graphs'!$A$12))","v":0.88254403648625357},{"$f":"O436-M436*SQRT('Other Graphs'!$A$12)","v":-0.75424397666633669},0.81125866153517667,0.22535136777048145,51.400214106479282]
[null,null,null,0.95000000000000073,{"$f":"IF($C$4, 'Other Graphs'!$A$6*H437-EXP(-1*'Other Graphs'!$A$12*D437)*'Other Graphs'!$A$9*I437,-1*'Other Graphs'!$A$6*H437+EXP(-1*'Other Graphs'!$A$12*D437)*'Other Graphs'!$A$9*I437)","v":103.63712470376778},{"$f":"(LN('Other Graphs'!$A$6/'Other Graphs'!$A$9)+(D437+0.5*'Other Graphs'!$A$15^2)*'Other Graphs'!$A$12)/('Other Graphs'!$A$15*SQRT('Other Graphs'!$A$12))","v":8.4004464167090624},{"$f":"F437-'Other Graphs'!$A$15*SQRT('Other Graphs'!$A$12)","v":8.0540362551952871},1,0.99999999999999956,18.946174341698434,null,null,0.95000000000000073,{"$f":"IF($C$4, 'Other Graphs'!$A$6*Q437-EXP(-1*'Other Graphs'!$A$12*'Other Graphs'!$A$3)*'Other Graphs'!$A$9*R437,-1*'Other Graphs'!$A$6*Q437+EXP(-1*'Other Graphs'!$A$12*'Other Graphs'!$A$3)*'Other Graphs'!$A$9*R437)","v":67.177623953168563},{"$f":"(LN('Other Graphs'!$A$6/'Other Graphs'!$A$9)+('Other Graphs'!$A$3+0.5*M437^2)*'Other Graphs'!$A$12)/(M437*SQRT('Other Graphs'!$A$12))","v":0.88653653176880765},{"$f":"O437-M437*SQRT('Other Graphs'!$A$12)","v":-0.75891173542162704},0.81233576125546736,0.22395267916810019,51.218524634214148]
[null,null,null,0.95500000000000074,{"$f":"IF($C$4, 'Other Graphs'!$A$6*H438-EXP(-1*'Other Graphs'!$A$12*D438)*'Other Graphs'!$A$9*I438,-1*'Other Graphs'!$A$6*H438+EXP(-1*'Other Graphs'!$A$12*D438)*'Other Graphs'!$A$9*I438)","v":103.73185557547627},{"$f":"(LN('Other Graphs'!$A$6/'Other Graphs'!$A$9)+(D438+0.5*'Other Graphs'!$A$15^2)*'Other Graphs'!$A$12)/('Other Graphs'!$A$15*SQRT('Other Graphs'!$A$12))","v":8.4437476868982841},{"$f":"F438-'Other Graphs'!$A$15*SQRT('Other Graphs'!$A$12)","v":8.0973375253845088},1,0.99999999999999967,18.664102553805133,null,null,0.95500000000000074,{"$f":"IF($C$4, 'Other Graphs'!$A$6*Q438-EXP(-1*'Other Graphs'!$A$12*'Other Graphs'!$A$3)*'Other Graphs'!$A$9*R438,-1*'Other Graphs'!$A$6*Q438+EXP(-1*'Other Graphs'!$A$12*'Other Graphs'!$A$3)*'Other Graphs'!$A$9*R438)","v":67.433716576339634},{"$f":"(LN('Other Graphs'!$A$6/'Other Graphs'!$A$9)+('Other Graphs'!$A$3+0.5*M438^2)*'Other Graphs'!$A$12)/(M438*SQRT('Other Graphs'!$A$12))","v":0.89053256246221368},{"$f":"O438-M438*SQRT('Other Graphs'!$A$12)","v":-0.76357595876606521},0.81341000406246755,0.22255999029020704,51.036503364505805]
[null,null,null,0.96000000000000074,{"$f":"IF($C$4, 'Other Graphs'!$A$6*H439-EXP(-1*'Other Graphs'!$A$12*D439)*'Other Graphs'!$A$9*I439,-1*'Other Graphs'!$A$6*H439+EXP(-1*'Other Graphs'!$A$12*D439)*'Other Graphs'!$A$9*I439)","v":103.8251760882453},{"$f":"(LN('Other Graphs'!$A$6/'Other Graphs'!$A$9)+(D439+0.5*'Other Graphs'!$A$15^2)*'Other Graphs'!$A$12)/('Other Graphs'!$A$15*SQRT('Other Graphs'!$A$12))","v":8.4870489570875041},{"$f":"F439-'Other Graphs'!$A$15*SQRT('Other Graphs'!$A$12)","v":8.1406387955737287},1,0.99999999999999978,18.38623026773119,null,null,0.96000000000000074,{"$f":"IF($C$4, 'Other Graphs'!$A$6*Q439-EXP(-1*'Other Graphs'!$A$12*'Other Graphs'!$A$3)*'Other Graphs'!$A$9*R439,-1*'Other Graphs'!$A$6*Q439+EXP(-1*'Other Graphs'!$A$12*'Other Graphs'!$A$3)*'Other Graphs'!$A$9*R439)","v":67.688899093162163},{"$f":"(LN('Other Graphs'!$A$6/'Other Graphs'!$A$9)+('Other Graphs'!$A$3+0.5*M439^2)*'Other Graphs'!$A$12)/(M439*SQRT('Other Graphs'!$A$12))","v":0.89453207332567708},{"$f":"O439-M439*SQRT('Other Graphs'!$A$12)","v":-0.76823670194044624},0.81448136145056427,0.22117328622672119,50.854158764747083]
[null,null,null,0.96500000000000075,{"$f":"IF($C$4, 'Other Graphs'!$A$6*H440-EXP(-1*'Other Graphs'!$A$12*D440)*'Other Graphs'!$A$9*I440,-1*'Other Graphs'!$A$6*H440+EXP(-1*'Other Graphs'!$A$12*D440)*'Other Graphs'!$A$9*I440)","v":103.91710723958396},{"$f":"(LN('Other Graphs'!$A$6/'Other Graphs'!$A$9)+(D440+0.5*'Other Graphs'!$A$15^2)*'Other Graphs'!$A$12)/('Other Graphs'!$A$15*SQRT('Other Graphs'!$A$12))","v":8.5303502272767275},{"$f":"F440-'Other Graphs'!$A$15*SQRT('Other Graphs'!$A$12)","v":8.1839400657629522},{"$f":"IF($C$4,NORMSDIST(F440),NORMSDIST(-1*F440))","v":1},{"$f":"IF($C$4,NORMSDIST(G440),NORMSDIST(-1*G440))","v":0.99999999999999989},{"$f":"(E441-E440)/(D441-D440)","v":18.112494961033558},null,null,{"$f":"M439+0.005","v":0.96500000000000075},{"$f":"IF($C$4, 'Other Graphs'!$A$6*Q440-EXP(-1*'Other Graphs'!$A$12*'Other Graphs'!$A$3)*'Other Graphs'!$A$9*R440,-1*'Other Graphs'!$A$6*Q440+EXP(-1*'Other Graphs'!$A$12*'Other Graphs'!$A$3)*'Other Graphs'!$A$9*R440)","v":67.943169886985899},{"$f":"(LN('Other Graphs'!$A$6/'Other Graphs'!$A$9)+('Other Graphs'!$A$3+0.5*M440^2)*'Other Graphs'!$A$12)/(M440*SQRT('Other Graphs'!$A$12))","v":0.8985350102632903},{"$f":"O440-M440*SQRT('Other Graphs'!$A$12)","v":-0.77289401904067745},{"$f":"IF($C$4,NORMSDIST(O440),NORMSDIST(-1*O440))","v":0.81554980553777612},{"$f":"IF($C$4,NORMSDIST(P440),NORMSDIST(-1*P440))","v":0.21979255233274475},{"$f":"(N441-N440)/(M441-M440)","v":50.671499277777301}]
[null,null,null,{"$f":"D440+0.005","v":0.97000000000000075},{"$f":"IF($C$4, 'Other Graphs'!$A$6*H441-EXP(-1*'Other Graphs'!$A$12*D441)*'Other Graphs'!$A$9*I441,-1*'Other Graphs'!$A$6*H441+EXP(-1*'Other Graphs'!$A$12*D441)*'Other Graphs'!$A$9*I441)","v":104.00766971438912},{"$f":"(LN('Other Graphs'!$A$6/'Other Graphs'!$A$9)+(D441+0.5*'Other Graphs'!$A$15^2)*'Other Graphs'!$A$12)/('Other Graphs'!$A$15*SQRT('Other Graphs'!$A$12))","v":8.5736514974659492},{"$f":"F441-'Other Graphs'!$A$15*SQRT('Other Graphs'!$A$12)","v":8.2272413359521739},1,0.99999999999999989,17.842835042114288,null,null,0.97000000000000075,{"$f":"IF($C$4, 'Other Graphs'!$A$6*Q441-EXP(-1*'Other Graphs'!$A$12*'Other Graphs'!$A$3)*'Other Graphs'!$A$9*R441,-1*'Other Graphs'!$A$6*Q441+EXP(-1*'Other Graphs'!$A$12*'Other Graphs'!$A$3)*'Other Graphs'!$A$9*R441)","v":68.196527383374786},{"$f":"(LN('Other Graphs'!$A$6/'Other Graphs'!$A$9)+('Other Graphs'!$A$3+0.5*M441^2)*'Other Graphs'!$A$12)/(M441*SQRT('Other Graphs'!$A$12))","v":0.9025413202945255},{"$f":"O441-M441*SQRT('Other Graphs'!$A$12)","v":-0.77754796304728668},0.81661530905417523,0.21841777421694153,50.488533321717412]
[null,null,null,0.97500000000000075,{"$f":"IF($C$4, 'Other Graphs'!$A$6*H442-EXP(-1*'Other Graphs'!$A$12*D442)*'Other Graphs'!$A$9*I442,-1*'Other Graphs'!$A$6*H442+EXP(-1*'Other Graphs'!$A$12*D442)*'Other Graphs'!$A$9*I442)","v":104.0968838895997},{"$f":"(LN('Other Graphs'!$A$6/'Other Graphs'!$A$9)+(D442+0.5*'Other Graphs'!$A$15^2)*'Other Graphs'!$A$12)/('Other Graphs'!$A$15*SQRT('Other Graphs'!$A$12))","v":8.6169527676551709},{"$f":"F442-'Other Graphs'!$A$15*SQRT('Other Graphs'!$A$12)","v":8.2705426061413956},1,0.99999999999999989,17.577189836356396,null,null,0.97500000000000075,{"$f":"IF($C$4, 'Other Graphs'!$A$6*Q442-EXP(-1*'Other Graphs'!$A$12*'Other Graphs'!$A$3)*'Other Graphs'!$A$9*R442,-1*'Other Graphs'!$A$6*Q442+EXP(-1*'Other Graphs'!$A$12*'Other Graphs'!$A$3)*'Other Graphs'!$A$9*R442)","v":68.448970049983373},{"$f":"(LN('Other Graphs'!$A$6/'Other Graphs'!$A$9)+('Other Graphs'!$A$3+0.5*M442^2)*'Other Graphs'!$A$12)/(M442*SQRT('Other Graphs'!$A$12))","v":0.90655095152563403},{"$f":"O442-M442*SQRT('Other Graphs'!$A$12)","v":-0.78219858585402258},0.81767784533064236,0.21704893773029554,50.305269289827905]
[null,null,null,0.98000000000000076,{"$f":"IF($C$4, 'Other Graphs'!$A$6*H443-EXP(-1*'Other Graphs'!$A$12*D443)*'Other Graphs'!$A$9*I443,-1*'Other Graphs'!$A$6*H443+EXP(-1*'Other Graphs'!$A$12*D443)*'Other Graphs'!$A$9*I443)","v":104.18476983878148},{"$f":"(LN('Other Graphs'!$A$6/'Other Graphs'!$A$9)+(D443+0.5*'Other Graphs'!$A$15^2)*'Other Graphs'!$A$12)/('Other Graphs'!$A$15*SQRT('Other Graphs'!$A$12))","v":8.6602540378443909},{"$f":"F443-'Other Graphs'!$A$15*SQRT('Other Graphs'!$A$12)","v":8.3138438763306155},1,1,17.315499572461576,null,null,0.98000000000000076,{"$f":"IF($C$4, 'Other Graphs'!$A$6*Q443-EXP(-1*'Other Graphs'!$A$12*'Other Graphs'!$A$3)*'Other Graphs'!$A$9*R443,-1*'Other Graphs'!$A$6*Q443+EXP(-1*'Other Graphs'!$A$12*'Other Graphs'!$A$3)*'Other Graphs'!$A$9*R443)","v":68.700496396432513},{"$f":"(LN('Other Graphs'!$A$6/'Other Graphs'!$A$9)+('Other Graphs'!$A$3+0.5*M443^2)*'Other Graphs'!$A$12)/(M443*SQRT('Other Graphs'!$A$12))","v":0.91056385312192478},{"$f":"O443-M443*SQRT('Other Graphs'!$A$12)","v":-0.78684593829557625},0.81873738828794529,0.21568602895523536,50.121715550275738]
[null,null,null,0.98500000000000076,{"$f":"IF($C$4, 'Other Graphs'!$A$6*H444-EXP(-1*'Other Graphs'!$A$12*D444)*'Other Graphs'!$A$9*I444,-1*'Other Graphs'!$A$6*H444+EXP(-1*'Other Graphs'!$A$12*D444)*'Other Graphs'!$A$9*I444)","v":104.27134733664379},{"$f":"(LN('Other Graphs'!$A$6/'Other Graphs'!$A$9)+(D444+0.5*'Other Graphs'!$A$15^2)*'Other Graphs'!$A$12)/('Other Graphs'!$A$15*SQRT('Other Graphs'!$A$12))","v":8.7035553080336143},{"$f":"F444-'Other Graphs'!$A$15*SQRT('Other Graphs'!$A$12)","v":8.357145146519839},1,1,17.057705369023765,null,null,0.98500000000000076,{"$f":"IF($C$4, 'Other Graphs'!$A$6*Q444-EXP(-1*'Other Graphs'!$A$12*'Other Graphs'!$A$3)*'Other Graphs'!$A$9*R444,-1*'Other Graphs'!$A$6*Q444+EXP(-1*'Other Graphs'!$A$12*'Other Graphs'!$A$3)*'Other Graphs'!$A$9*R444)","v":68.951104974183892},{"$f":"(LN('Other Graphs'!$A$6/'Other Graphs'!$A$9)+('Other Graphs'!$A$3+0.5*M444^2)*'Other Graphs'!$A$12)/(M444*SQRT('Other Graphs'!$A$12))","v":0.91457997528088153},{"$f":"O444-M444*SQRT('Other Graphs'!$A$12)","v":-0.79149007017446393},0.81979391242612398,0.2143290341951109,49.937880445997919]
[null,null,null,0.99000000000000077,{"$f":"IF($C$4, 'Other Graphs'!$A$6*H445-EXP(-1*'Other Graphs'!$A$12*D445)*'Other Graphs'!$A$9*I445,-1*'Other Graphs'!$A$6*H445+EXP(-1*'Other Graphs'!$A$12*D445)*'Other Graphs'!$A$9*I445)","v":104.3566358634889},{"$f":"(LN('Other Graphs'!$A$6/'Other Graphs'!$A$9)+(D445+0.5*'Other Graphs'!$A$15^2)*'Other Graphs'!$A$12)/('Other Graphs'!$A$15*SQRT('Other Graphs'!$A$12))","v":8.746856578222836},{"$f":"F445-'Other Graphs'!$A$15*SQRT('Other Graphs'!$A$12)","v":8.4004464167090607},1,1,16.803749221259054,null,null,0.99000000000000077,{"$f":"IF($C$4, 'Other Graphs'!$A$6*Q445-EXP(-1*'Other Graphs'!$A$12*'Other Graphs'!$A$3)*'Other Graphs'!$A$9*R445,-1*'Other Graphs'!$A$6*Q445+EXP(-1*'Other Graphs'!$A$12*'Other Graphs'!$A$3)*'Other Graphs'!$A$9*R445)","v":69.200794376413882},{"$f":"(LN('Other Graphs'!$A$6/'Other Graphs'!$A$9)+('Other Graphs'!$A$3+0.5*M445^2)*'Other Graphs'!$A$12)/(M445*SQRT('Other Graphs'!$A$12))","v":0.91859926920610091},{"$f":"O445-M445*SQRT('Other Graphs'!$A$12)","v":-0.79613103028708876},0.82084739281417796,0.21297793996401296,49.753772294474132]
[null,null,null,0.99500000000000077,{"$f":"IF($C$4, 'Other Graphs'!$A$6*H446-EXP(-1*'Other Graphs'!$A$12*D446)*'Other Graphs'!$A$9*I446,-1*'Other Graphs'!$A$6*H446+EXP(-1*'Other Graphs'!$A$12*D446)*'Other Graphs'!$A$9*I446)","v":104.4406546095952},{"$f":"(LN('Other Graphs'!$A$6/'Other Graphs'!$A$9)+(D446+0.5*'Other Graphs'!$A$15^2)*'Other Graphs'!$A$12)/('Other Graphs'!$A$15*SQRT('Other Graphs'!$A$12))","v":8.7901578484120595},{"$f":"F446-'Other Graphs'!$A$15*SQRT('Other Graphs'!$A$12)","v":8.4437476868982841},1,1,16.553573987954803,null,null,0.99500000000000077,{"$f":"IF($C$4, 'Other Graphs'!$A$6*Q446-EXP(-1*'Other Graphs'!$A$12*'Other Graphs'!$A$3)*'Other Graphs'!$A$9*R446,-1*'Other Graphs'!$A$6*Q446+EXP(-1*'Other Graphs'!$A$12*'Other Graphs'!$A$3)*'Other Graphs'!$A$9*R446)","v":69.449563237886252},{"$f":"(LN('Other Graphs'!$A$6/'Other Graphs'!$A$9)+('Other Graphs'!$A$3+0.5*M446^2)*'Other Graphs'!$A$12)/(M446*SQRT('Other Graphs'!$A$12))","v":0.92262168708201042},{"$f":"O446-M446*SQRT('Other Graphs'!$A$12)","v":-0.80076886644902368},0.8218978050800384,0.21163273297692042,49.569399387517514]
[null,null,null,1.0000000000000007,{"$f":"IF($C$4, 'Other Graphs'!$A$6*H447-EXP(-1*'Other Graphs'!$A$12*D447)*'Other Graphs'!$A$9*I447,-1*'Other Graphs'!$A$6*H447+EXP(-1*'Other Graphs'!$A$12*D447)*'Other Graphs'!$A$9*I447)","v":104.52342247953497},{"$f":"(LN('Other Graphs'!$A$6/'Other Graphs'!$A$9)+(D447+0.5*'Other Graphs'!$A$15^2)*'Other Graphs'!$A$12)/('Other Graphs'!$A$15*SQRT('Other Graphs'!$A$12))","v":8.8334591186012812},{"$f":"F447-'Other Graphs'!$A$15*SQRT('Other Graphs'!$A$12)","v":8.4870489570875058},1,1,104.5234224795349,null,null,1.0000000000000007,{"$f":"IF($C$4, 'Other Graphs'!$A$6*Q447-EXP(-1*'Other Graphs'!$A$12*'Other Graphs'!$A$3)*'Other Graphs'!$A$9*R447,-1*'Other Graphs'!$A$6*Q447+EXP(-1*'Other Graphs'!$A$12*'Other Graphs'!$A$3)*'Other Graphs'!$A$9*R447)","v":69.697410234823835},{"$f":"(LN('Other Graphs'!$A$6/'Other Graphs'!$A$9)+('Other Graphs'!$A$3+0.5*M447^2)*'Other Graphs'!$A$12)/(M447*SQRT('Other Graphs'!$A$12))","v":0.92664718204935004},{"$f":"O447-M447*SQRT('Other Graphs'!$A$12)","v":-0.80540362551952827},0.82294512540081999,0.21029340014016834,69.697410234823792]